program: Gaussian 09
title: 000005834
version: EM64L-G09RevD.01
frameworkgroup: C1[X(C23H30O6)]
method: RPBEPBE
basis: SDD
operation: Freq
keyword: #pfreq=noraman
keyword: PBEPBE/SDD
title: #p freq=noraman PBEPBE/SDD
converged: YES YES NO NO
title: Mulliken charges:
elementType: O O O O O O C C C C C C C C C C C C C C C C C C C C C C C H H H H H H H H H H H H H H H H H H H H H H H H H H H H H H
charge: -0.466286 -0.462239 -0.181347 -0.245626 -0.255291 -0.243951 0.373035 -0.112602 -0.157349 -0.168093 0.106049 -0.637718 -0.551475 -0.159531 0.138028 -0.542807 -0.476028 -0.840194 -0.646931 0.572591 0.122340 -0.772493 -0.190689 -0.655091 -0.412716 -0.413393 0.182391 0.313807 -0.754346 0.257846 0.251644 0.245887 0.271293 0.209430 0.223175 0.244891 0.222501 0.277258 0.213584 0.227489 0.216927 0.220224 0.272219 0.241958 0.227043 0.234647 0.277234 0.229003 0.217374 0.259630 0.344460 0.344331 0.262025 0.277259 0.263816 0.252419 0.260816 0.246912 0.244662
chargesum: 0.00000
title: Mulliken charges with hydrogens summed into heavy atoms:
elementType: O O O O O O C C C C C C C C C C C C C C C C C C C C C C C
charge: -0.121827 -0.117909 -0.181347 -0.245626 -0.255291 -0.243951 0.373035 0.145244 0.094294 0.077794 0.106049 -0.156995 -0.083409 0.062970 0.138028 -0.051965 -0.031613 -0.105792 -0.185241 0.572591 0.122340 -0.048882 0.068941 -0.393066 0.128359 -0.160974 0.182391 0.313807 -0.001956
polarizability: 3.43964026e+02 -9.56570137e+00 2.34471889e+02 -3.31352543e+01 3.05444729e+00 2.11971712e+02
1716.lowfreq: -8.2629 -0.0007 -0.0005 -0.0002 1.0706 8.0460 17.8917 25.3115 36.0746
frequency: 17.6996 25.1820 35.9943 42.6624 55.4645 68.5903 77.2953 84.8657 93.3130 113.6561 129.1764 151.5680 164.2739 182.3441 193.5172 208.9796 212.3575 218.4666 230.8359 242.0157 250.6238 266.8583 278.0479 284.5586 300.5067 303.2287 310.2422 315.1561 322.3927 327.7287 345.0253 364.1444 372.1673 397.4669 411.6520 416.7187 438.2881 445.0906 452.4603 477.3197 491.9221 513.2944 522.6458 534.5573 557.2460 561.3958 575.7616 614.5883 628.1890 633.8354 666.5610 689.3971 695.8738 731.3531 748.2775 757.0524 786.7177 789.5981 792.9002 820.1674 829.5741 850.0009 858.8976 873.1515 900.0455 903.3792 911.9439 921.9291 930.7400 941.9857 950.3665 962.3778 974.4528 978.2597 998.6247 1003.1450 1013.0421 1017.5151 1025.5896 1030.9553 1033.5806 1042.4211 1055.7811 1065.8348 1076.7267 1096.8053 1101.7872 1109.3056 1112.4634 1121.2778 1139.6412 1150.7853 1154.6010 1164.1205 1179.2396 1184.7430 1197.8479 1208.5050 1212.4826 1220.6804 1224.4026 1242.8021 1250.0225 1261.9205 1271.6582 1282.2304 1286.1189 1289.1993 1296.5931 1301.2168 1306.5353 1322.2962 1328.8459 1330.9221 1339.7544 1347.4897 1350.4282 1360.6894 1366.3303 1378.0350 1380.8869 1383.9522 1391.4260 1400.9745 1404.6813 1453.5401 1454.3092 1454.4929 1462.7204 1463.9969 1465.8750 1468.2567 1473.1483 1483.7743 1494.7862 1496.7672 1555.6448 1610.4535 1626.4235 1659.8398 1665.6889 2932.4294 2944.2717 2951.7701 2955.7420 2963.4574 2975.6121 2993.1733 2993.7771 2994.9195 2998.1182 3002.9681 3008.6885 3012.8341 3035.5413 3044.8618 3047.2507 3058.6452 3075.4832 3080.2396 3088.9464 3101.3569 3104.7842 3111.1201 3111.3450 3125.6389 3126.5427 3142.7797 3147.9238 3555.3219 3561.2693
redmass: 5.1782 7.0193 4.6043 7.3519 4.5935 5.4665 2.6072 1.3946 2.4937 3.4086 3.5142 5.4687 2.9527 4.4801 1.6544 3.0984 3.6252 3.4577 1.5437 3.3593 2.1285 2.9087 3.1276 2.5592 1.7270 2.1602 2.5101 1.4256 3.1536 3.2600 3.8352 2.8684 2.8626 3.4886 3.4442 3.2637 3.6786 2.8713 2.7997 3.4580 3.4903 3.7724 3.3239 4.0284 3.2514 3.3087 2.9412 4.7749 4.2398 3.9967 4.0482 3.1909 3.1771 4.0528 4.9016 3.9675 2.9159 2.6353 2.7260 1.9463 1.7488 2.3964 2.8506 2.7146 2.8536 1.9987 1.8399 2.1085 2.3371 2.0342 1.7244 2.3570 2.6497 2.5710 2.7465 1.3244 2.5733 3.1112 2.3390 2.2026 2.0807 1.6573 2.6905 2.3315 2.8855 2.4191 1.9500 2.4348 1.8232 1.8024 1.7230 1.6735 2.1220 2.1831 1.8708 1.3230 3.5829 1.2526 1.6307 1.2315 1.3848 1.6156 1.5121 1.5205 1.4819 1.3518 1.4171 2.1158 1.4212 1.4276 1.4742 1.3288 1.4380 1.3821 1.4390 1.4801 1.5860 1.4010 1.4653 2.0205 1.4791 1.2394 1.3335 1.1110 1.1860 1.0560 1.0623 1.0540 1.0761 1.0791 1.0834 1.0883 1.0738 1.0874 1.0573 1.0548 8.5576 8.4725 10.2482 7.3367 9.5686 1.0807 1.0759 1.0804 1.0769 1.0634 1.0629 1.0523 1.0660 1.0597 1.0427 1.0663 1.0376 1.0632 1.0974 1.0925 1.0997 1.0984 1.0988 1.0970 1.0992 1.0953 1.0870 1.0994 1.0965 1.0983 1.0922 1.1020 1.0975 1.0658 1.0662
irintensity: 0.5691 2.0193 1.6969 0.6469 1.4719 0.4313 3.4881 0.4811 2.0630 4.3039 1.3545 1.7215 1.3859 1.9388 0.6802 5.3640 2.5672 7.8568 6.7782 0.8188 4.6027 1.9321 6.7664 30.2748 77.8484 37.5620 11.3657 120.5700 26.4362 12.3520 1.2688 1.5190 7.1662 1.7338 6.8848 1.8166 15.9442 6.6980 2.7403 5.0352 11.7636 2.5343 4.1263 2.1468 4.9775 3.6065 7.8272 7.4918 2.0833 1.6605 4.9625 9.2871 5.6777 8.8559 6.7223 2.0966 19.8267 12.5907 4.5291 3.4957 15.9065 19.5699 7.0617 9.6584 43.6227 64.4427 8.1624 8.0542 29.5753 12.9240 4.6897 7.1640 21.0918 5.4529 29.9866 0.4190 84.2915 28.3401 12.2047 10.6919 1.7265 12.6797 10.0073 23.0912 3.6724 41.0541 11.3010 18.5372 10.9667 18.8388 7.5187 19.4197 16.7898 69.4304 10.5955 19.4282 267.2909 15.3898 8.5017 12.5337 8.0561 18.9584 2.2217 1.6749 12.3165 8.7423 18.3143 21.2453 18.3795 3.7878 15.2435 4.7072 34.0962 12.5502 10.0032 2.3979 1.9759 6.2076 3.1888 12.6385 4.0760 59.0432 16.5784 64.1776 10.9374 22.1146 2.8669 19.7045 25.3495 2.5012 6.5540 17.8817 12.3966 4.4241 4.8868 11.3207 190.3974 13.0243 72.6203 169.2811 176.5643 14.9325 26.9217 9.3353 65.1595 25.3925 20.0758 7.3211 21.7006 28.7741 38.5503 22.1976 0.9085 26.9549 47.0987 9.5052 33.3874 17.8742 23.5809 19.7784 34.6805 8.2537 6.8338 11.7621 0.4847 2.2087 13.5571 9.9470 14.3461 4.5524 8.3047
temp: 298.150 k
press: 1.00000 atm
elementType: 8 8 8 8 8 8 6 6 6 6 6 6 6 6 6 6 6 6 6 6 6 6 6 6 6 6 6 6 6 1 1 1 1 1 1 1 1 1 1 1 1 1 1 1 1 1 1 1 1 1 1 1 1 1 1 1 1 1 1
symmnumber: 1
zpe: 1279285.4 jmol-1
zpe.correction: 0.487254 hartree
zpe.thermalcorrener: 0.515726 hartree
zpe.thermalcorrenthalpy: 0.516670 hartree
zpe.thermalcorrgfe: 0.428572 hartree
zpe.sumelectzpe: -1343.558695 hartree
zpe.sumelectthermal: -1343.530224 hartree
zpe.sumelectthermalent: -1343.529280 hartree
zpe.sumelectthermalfe: -1343.617378 hartree
dipole: -4.1924 0.9948 2.0063
dipole: 4.7530
quadrupole: -234.8635 -158.0987 -177.9829
quadrupole: 23.1564 15.5687 -7.4614
quadrupole: -44.5485 32.2163 12.3322 23.1564 15.5687 -7.4614
hfenergy: -1344.0459495 hartree
pointgroup: C01 [X(C23H30O6)]
dipole: -1.6533206 -0.5191892 -0.7026746 debye
polarizability: 344.4623562|15.4713602|235.2283189|29.587411|-0.0799084|210.7169512 unknown
InChI: InChI=1S/C23H30O6/c1-13(24)29-12-19(27)23(28)9-7-17-16-5-4-14-10-15(25)6-8-21(14,2)20(16)18(26)11-22(17,23)3/h6,8,10,16-18,20,26,28H,4-5,7,9,11-12H2,1-3H3
charge 0 multiplicity 1
59 atoms
O  -2.090629 -0.439847 2.056376
O  0.770688 1.492827 -1.923268
O  -4.3401 -1.044502 -0.692513
O  -5.248802 1.441276 0.022575
O  6.674026 1.576231 1.638982
O  -6.806759 0.195516 1.236539
C  -1.080208 -0.462337 -0.188719
C  0.007412 -1.459365 0.325879
C  1.378459 -1.283927 -0.359676
C  1.864088 0.183188 -0.126445
C  -2.309833 -0.964348 0.682951
C  -0.599425 0.972147 0.12011
C  -0.69249 -2.838522 0.273413
C  0.811522 1.278188 -0.455781
C  3.316594 0.437422 -0.744591
C  -2.181723 -2.519581 0.632123
C  2.40304 -2.282596 0.238966
C  -1.408841 -0.645942 -1.693954
C  3.862956 -2.026873 -0.227277
C  4.240561 -0.570255 -0.055366
C  -3.672762 -0.448808 0.188162
C  3.383752 0.209598 -2.296354
C  3.736437 1.873511 -0.498234
C  5.311231 -0.181605 0.704346
C  -4.180791 0.848161 0.837885
C  4.812807 2.241368 0.25302
C  5.674046 1.235058 0.921732
C  -6.549575 0.960787 0.283329
C  -7.520002 1.50604 -0.735027
H  0.15387 -1.211744 1.39998
H  1.277998 -1.477514 -1.446027
H  2.006992 0.28309 0.974013
H  -0.565438 1.105656 1.217439
H  -1.304372 1.733745 -0.277686
H  -0.244465 -3.559029 0.978866
H  -0.618143 -3.278707 -0.738617
H  1.15427 2.225388 0.014389
H  -2.883624 -2.91843 -0.119628
H  -2.472761 -2.957404 1.606623
H  2.112462 -3.318525 -0.019702
H  2.365897 -2.202072 1.345399
H  -2.149324 0.104434 -2.027387
H  -0.503871 -0.508612 -2.305151
H  -1.842756 -1.636449 -1.910316
H  3.954063 -2.316135 -1.293703
H  4.557891 -2.67161 0.340632
H  2.767838 0.95925 -2.813379
H  4.432512 0.292147 -2.63363
H  3.007691 -0.787164 -2.580926
H  3.138835 2.634142 -1.018558
H  -2.540601 -1.042375 2.701211
H  -0.011762 2.063373 -2.132453
H  5.953594 -0.922934 1.196313
H  -3.382031 1.600844 0.914346
H  -4.559082 0.625397 1.853819
H  5.096944 3.291992 0.385243
H  -7.441418 0.9047 -1.658923
H  -7.275995 2.548986 -0.992338
H  -8.547695 1.43245 -0.350434
