program: Gaussian 09
title: 000034859
version: EM64L-G09RevD.01
frameworkgroup: C1[X(C17H16)]
method: RPBEPBE
basis: SDD
operation: Freq
keyword: #p
keyword: freq=noraman
keyword: PBEPBE/SDD
title: #p freq=noraman PBEPBE/SDD
converged: NO YES NO NO
title: Mulliken charges:
elementType: C C C C C C C C C C C C C C C C C H H H H H H H H H H H H H H H H
charge: 0.082740 0.247286 0.268453 0.234001 0.339666 0.364899 -0.758692 0.275591 -0.363496 -0.409268 -0.438862 -0.458154 -0.864206 -0.279248 -0.295585 -0.880965 -0.837432 0.248256 0.244752 0.252053 0.224796 0.233805 0.231197 0.244794 0.231245 0.227913 0.222596 0.235397 0.236996 0.235338 0.239644 0.232253 0.232237
chargesum: 0.00000
title: Mulliken charges with hydrogens summed into heavy atoms:
elementType: C C C C C C C C C C C C C C C C C
charge: 0.082740 0.247286 0.268453 0.234001 0.339666 0.364899 -0.510436 0.275591 -0.118744 -0.157215 -0.214066 -0.224349 -0.156970 -0.051335 -0.072989 -0.173233 -0.133297
polarizability: 2.82527555e+02 -1.08344097e+01 2.17939143e+02 1.27134757e-03 4.83695797e-04 8.46344730e+01
1716.lowfreq: -25.7933 -0.0005 -0.0005 0.0004 3.4234 6.4730 12.4295 61.8841 135.9600
frequency: -25.4921 61.8743 135.9566 178.0977 180.5522 211.0221 222.7199 236.5104 274.3245 281.1131 327.4261 328.2486 337.2549 373.0831 425.3938 447.4891 466.2929 493.0371 504.3372 533.0279 540.6149 551.1550 579.5200 597.2247 638.0276 663.6465 744.3541 744.5856 762.6289 795.9022 838.2125 847.8480 856.5574 890.5515 895.0583 906.5031 911.3287 975.6377 980.2327 993.1014 1000.3267 1021.8922 1044.1735 1046.8673 1048.8061 1050.2445 1101.8198 1127.9579 1143.2088 1183.3222 1192.7776 1232.7117 1253.4579 1257.6000 1278.2171 1291.0175 1347.8972 1381.7819 1386.0549 1395.3725 1398.7450 1401.2551 1404.2702 1426.8573 1454.8888 1473.3974 1475.1279 1476.3419 1485.7706 1491.8324 1497.8103 1501.8108 1544.1395 1584.7786 1602.7398 1611.3234 1637.7852 2971.1217 2971.5152 2974.0328 3045.9688 3047.5686 3058.2035 3073.1132 3082.4330 3083.4066 3120.8863 3121.5217 3143.4847 3145.7649 3147.4365 3168.5244 3268.8112
redmass: 3.0903 3.5861 3.4636 2.6992 2.4572 1.1177 3.6956 1.1492 3.1434 3.3304 3.3445 3.3449 3.9063 1.1561 4.3266 3.7914 3.3152 3.5719 5.0389 5.5331 3.0135 4.5208 3.7707 3.3041 3.0613 5.6495 5.7599 2.6309 1.2278 1.5402 4.1693 2.9151 5.0420 4.3410 1.4130 1.3989 1.6306 1.3467 1.3501 1.6927 1.6913 1.5751 1.5642 1.5644 1.5930 3.0966 1.9279 1.8284 3.4294 1.2957 1.2706 1.9069 1.8359 2.8751 1.8932 2.6440 5.6132 3.0975 2.1360 2.3043 1.4802 1.2775 1.4963 2.4550 2.3017 1.0466 1.0470 1.2856 1.1876 1.0485 2.2692 1.1246 4.8142 7.2405 5.3019 5.9920 6.7569 1.0376 1.0376 1.0371 1.0973 1.0976 1.0986 1.0976 1.0980 1.0979 1.0871 1.0873 1.0916 1.0960 1.0910 1.0972 1.0886
irintensity: 0.0235 0.0288 3.7221 2.6503 0.1424 1.4429 0.7815 0.0004 5.1142 0.0713 0.5380 0.3838 1.2648 0.3865 0.9711 0.9883 0.6630 0.5145 0.6460 4.4066 0.2366 0.7805 0.4215 0.7712 1.4143 0.4188 2.9144 4.3481 96.8137 5.3084 0.1538 14.7546 3.0961 1.7122 8.5729 6.8891 4.2500 0.3164 0.2329 2.9116 0.3399 5.4322 6.2504 8.9335 3.4085 4.8640 4.5645 6.5753 4.2825 1.1622 0.3910 1.8137 2.1182 1.0875 1.6331 8.2971 1.6705 0.1308 3.6670 3.9778 18.4106 18.1437 1.5239 15.0701 20.8785 23.8019 3.3328 11.6781 25.0311 13.3621 4.0499 19.9887 2.0387 5.1174 4.2821 4.3174 8.5178 30.3420 51.3088 27.4584 17.2162 22.7325 16.0795 30.5388 24.0685 18.6183 9.9456 15.4601 24.3342 39.3226 14.3546 29.1610 7.3980
temp: 298.150 k
press: 1.00000 atm
elementType: 6 6 6 6 6 6 6 6 6 6 6 6 6 6 6 6 6 1 1 1 1 1 1 1 1 1 1 1 1 1 1 1 1
symmnumber: 1
zpe: 720203.5 jmol-1
zpe.correction: 0.274311 hartree
zpe.thermalcorrener: 0.287581 hartree
zpe.thermalcorrenthalpy: 0.288525 hartree
zpe.thermalcorrgfe: 0.235767 hartree
zpe.sumelectzpe: -656.255544 hartree
zpe.sumelectthermal: -656.242274 hartree
zpe.sumelectthermalent: -656.241329 hartree
zpe.sumelectthermalfe: -656.294088 hartree
dipole: -0.0081 0.3553 -0.0002
dipole: 0.3554
quadrupole: -88.5867 -87.0735 -107.1348
quadrupole: 1.3578 -0.0021 -0.0009
quadrupole: 5.6783 7.1915 -12.8698 1.3578 -0.0021 -0.0009
hfenergy: -656.5298546 hartree
pointgroup: C01 [X(C17H16)]
dipole: -0.0100231 0.1394472 -0.0000857 debye
polarizability: 283.433956|-7.617077|217.0327418|0.0012461|0.0005455|84.634473 unknown
InChI: InChI=1S/C17H16/c1-11-6-4-9-15-16(11)10-13(3)14-8-5-7-12(2)17(14)15/h4-10H,1-3H3
charge 0 multiplicity 1
33 atoms
C  -0.882583 -0.471089 -0.000024
C  0.583933 -0.685258 -0.00009
C  -1.372186 0.903081 -0.000076
C  1.468892 0.467264 0.000147
C  -0.450782 2.031547 0.000216
C  -1.883623 -1.526922 0.000013
C  0.90978 1.794961 0.000337
C  2.903389 0.311917 0.000062
C  1.216708 -1.971076 -0.000401
C  -2.773598 1.179476 -0.000302
C  -3.254948 -1.189135 -0.000072
C  3.45566 -0.97772 -0.000266
C  -0.965007 3.461065 -0.000324
C  -3.712751 0.148956 -0.000383
C  2.61012 -2.114937 -0.000507
C  -1.609243 -3.027538 0.001434
C  3.82818 1.519469 0.000042
H  1.590872 2.651295 0.000482
H  0.631214 -2.883273 -0.000899
H  -3.114543 2.218071 -0.000335
H  -3.990569 -2.001848 0.000128
H  4.544659 -1.103055 -0.000362
H  -1.586189 3.677325 0.889894
H  -0.122322 4.172204 0.000114
H  -1.585023 3.677034 -0.891429
H  -4.786275 0.366504 -0.000523
H  3.046039 -3.120366 -0.000905
H  -1.049375 -3.354629 0.896912
H  -2.567649 -3.574426 0.003525
H  -1.052075 -3.356882 -0.894912
H  4.882484 1.195401 0.000074
H  3.67502 2.157509 -0.891075
H  3.674991 2.157574 0.891108
