program: Gaussian 09
title: 000034854
version: EM64L-G09RevD.01
frameworkgroup: C1[X(C10H10N2O3)]
method: RPBEPBE
basis: SDD
operation: Freq
keyword: #p
keyword: freq=noraman
keyword: PBEPBE/SDD
title: #p freq=noraman PBEPBE/SDD
converged: YES YES NO NO
title: Mulliken charges:
elementType: O O O N N C C C C C C C C C C H H H H H H H H H H
charge: -0.189135 -0.197742 -0.235656 -0.146204 -0.373191 -0.451330 0.226797 -0.447582 0.259506 0.467198 -0.349783 -0.427087 -0.220755 -0.219213 -0.230077 0.262942 0.268520 0.229081 0.235718 0.338336 0.277092 0.234905 0.229397 0.228525 0.229738
chargesum: 0.00000
title: Mulliken charges with hydrogens summed into heavy atoms:
elementType: O O O N N C C C C C C C C C C
charge: -0.189135 -0.197742 -0.235656 -0.146204 -0.034855 0.080132 0.226797 0.017216 0.259506 0.467198 -0.072691 -0.192182 0.008642 0.009313 -0.000339
polarizability: 1.87324649e+02 -6.52131769e+00 1.36249097e+02 9.11282372e+00 -4.28875938e+00 6.52572572e+01
1716.lowfreq: -0.0013 -0.0008 0.0001 4.5296 5.6195 8.7332 18.4980 37.0705 45.6600
frequency: 18.3542 37.0229 45.5773 79.9092 111.7205 126.9585 197.6701 230.1546 280.9044 296.7532 357.0813 386.2945 404.4363 451.9549 491.8676 542.3547 555.7849 568.5688 602.4257 616.6694 679.2020 695.9203 702.7738 722.1223 754.8799 820.8165 849.7083 859.8179 927.3762 979.5170 983.9300 987.3643 989.9845 998.5273 1002.2711 1027.2772 1043.1512 1089.5412 1104.4774 1160.7998 1168.6375 1174.2342 1185.3055 1191.3241 1230.7113 1255.0304 1321.3401 1329.9210 1350.1458 1376.7156 1388.2258 1441.9045 1461.3731 1472.7638 1486.8944 1595.6186 1616.5726 1672.3806 1726.0117 3003.9227 3008.1327 3059.5380 3080.0358 3122.1685 3128.0736 3138.0783 3150.2300 3165.2245 3609.7635
redmass: 5.7394 5.1055 4.4438 4.6043 6.0434 8.5727 3.1991 5.4810 5.0122 5.7182 4.0815 5.6720 2.8174 1.0785 3.4671 7.6250 3.4806 4.6923 7.5086 6.3026 8.1182 9.6014 2.1665 4.4545 1.9010 5.0051 3.6520 1.3529 1.4099 1.6711 1.5694 1.9390 5.5576 3.7561 1.4071 2.1908 2.6935 1.5836 5.9896 1.0908 1.1657 1.0628 3.7335 1.1355 2.5164 2.9174 1.7281 1.4018 1.5379 1.7406 7.9531 2.1703 1.0971 1.1173 2.3724 6.0902 5.9906 11.2778 10.4191 1.0580 1.0563 1.1054 1.1102 1.0860 1.0879 1.0925 1.0967 1.1017 1.0803
irintensity: 1.2661 0.7584 3.1884 6.3030 2.8121 6.4210 13.0215 3.3988 7.0475 0.2064 5.8737 5.3732 0.5952 146.3363 11.1996 13.9088 2.3430 2.3722 11.2661 0.3291 26.7165 16.3644 65.4323 15.5176 70.7119 27.8516 24.4883 3.5754 1.8627 9.5337 7.3256 2.7193 0.2140 38.9721 1.8353 7.7912 35.0509 2.6812 69.9571 0.9391 5.7721 0.7702 133.1196 2.1871 6.2179 77.9170 23.7157 20.3573 76.3532 11.4629 2.5251 11.5855 19.8879 3.8673 8.2071 2.3655 0.2643 661.7182 116.9635 20.6553 27.6200 8.5098 13.6975 3.1429 1.5553 11.0233 28.1981 27.8449 63.8829
temp: 298.150 k
press: 1.00000 atm
elementType: 8 8 8 7 7 6 6 6 6 6 6 6 6 6 6 1 1 1 1 1 1 1 1 1 1
symmnumber: 1
zpe: 494609.2 jmol-1
zpe.correction: 0.188387 hartree
zpe.thermalcorrener: 0.201626 hartree
zpe.thermalcorrenthalpy: 0.202570 hartree
zpe.thermalcorrgfe: 0.146005 hartree
zpe.sumelectzpe: -721.118126 hartree
zpe.sumelectthermal: -721.104887 hartree
zpe.sumelectthermalent: -721.103943 hartree
zpe.sumelectthermalfe: -721.160508 hartree
dipole: 2.1534 1.0999 2.0457
dipole: 3.1673
quadrupole: -55.9425 -94.3820 -88.4058
quadrupole: 10.7163 3.9302 -3.9262
quadrupole: 23.6342 -14.8052 -8.8290 10.7163 3.9302 -3.9262
hfenergy: -721.3065131 hartree
pointgroup: C01 [X(C10H10N2O3)]
dipole: 0.8498237 -0.4714964 -0.7799448 debye
dipolederiv: -0.5411367 -0.0017448 -0.0581657 -0.0117071 -0.2497798 -0.0062387 -0.3335279 0.0326272 -0.1345236 -0.4572728 0.0025864 0.0120128 -0.3189825 -1.1903258 -0.0761115 -0.0218228 -0.055597 -0.3316453 -0.8552232 -0.2863494 0.0231166 -0.324354 -1.0049651 0.014749 -0.0225354 -0.0095499 -0.3374149 -0.3834305 -0.4417555 -0.0496714 -0.2493108 -1.218445 -0.0439248 -0.0838658 -0.0459729 -0.1644137 -1.184099 0.0039507 0.0212154 -0.0209425 -0.4473696 0.0139171 0.0554598 0.0063137 -0.5166925 -0.1898074 0.2856543 0.0629 0.356587 0.2414609 -0.0363897 0.0698357 -0.0255504 0.3205599 1.0185256 0.4402974 -0.0174358 0.7128349 1.6293167 0.1200761 -0.0055322 0.0461625 0.1982142 0.9283123 0.0395673 0.060459 0.0412592 0.3213791 -0.0407459 0.4511225 -0.0540292 0.3453204 1.5910091 0.1088068 -0.0956697 0.0120889 1.7459041 0.0237007 -0.0536204 0.0699227 0.2997021 -0.1141132 -0.0331083 -0.0280765 -0.0343538 -0.0295021 0.0152028 -0.0457427 0.0215516 -0.0894064 0.0229115 -0.080802 0.0047866 -0.0100912 -0.0401337 -0.0145642 0.0423706 -0.0126009 -0.1248971 -0.0312475 0.0709197 -0.0367901 -0.0776 0.0573937 -0.0534573 -0.0438075 -0.0562818 -0.1270855 -0.1249245 0.0606915 -0.0290648 0.0734914 0.1136468 -0.07308 -0.0351641 -0.0922358 -0.1229383 -0.0065115 -0.1322036 -0.0028265 -0.1465489 -0.0090306 -0.0125295 0.0170312 -0.0112619 -0.1453474 0.0760092 0.0234914 -0.0631339 0.0300928 -0.0256139 -0.040579 -0.0590843 -0.0380636 -0.1307068 0.050513 -0.0461502 0.0503173 -0.0530065 0.0305714 0.0269041 0.1045838 0.0482126 -0.0246223 0.0131053 -0.0451363 -0.0702902 -0.0402231 0.0367015 -0.0104633 -0.1154537 -0.0351364 0.0063185 -0.0955675 0.0277316 0.0723467 0.0699139 0.0019777 -0.1029518 -0.028139 -0.0284632 -0.0123651 -0.0004337 -0.0018516 -0.0270795 -0.014893 -0.08297 0.1054566 -0.0639594 0.0443253 0.0144034 0.2038209 -0.032835 0.0165847 -0.0513719 0.1510798 -0.0121835 0.018763 -0.0137569 0.3886608 0.0850886 0.0803842 0.0137726 0.079828 0.0541265 0.014072 0.0104277 0.0141787 0.1405989 0.0832724 -0.064507 0.0352128 -0.0373844 -0.0700381 0.0654132 0.0245206 0.0681905 0.1277872 0.0662881 -0.0344218 0.0270981 -0.0578784 -0.0888071 0.0732613 0.0321536 0.0729042 0.1313838 -0.0429815 0.1034599 0.0116868 0.1200628 -0.008094 0.0200367 0.0158175 0.022617 0.1519649 -0.1121068 -0.0466755 0.0666947 -0.0475106 0.0815165 0.0304296 0.0701691 0.0314941 0.1371446 unknown
polarizability: 186.9227514|6.7701758|135.553622|-10.3643264|-9.3923912|66.3546301 unknown
InChI: InChI=1S/C10H10N2O3/c13-9-6-11-10(14)12(9)15-7-8-4-2-1-3-5-8/h1-5,11H,6-7H2
charge 0 multiplicity 1
25 atoms
O  0.443928 0.5400 0.433231
O  2.765314 2.406094 0.128912
O  1.452342 -2.150051 -0.014381
N  1.782944 0.229234 0.100545
N  3.582426 -1.079973 -0.159028
C  4.102093 0.295406 -0.126554
C  2.831056 1.160552 0.051785
C  -0.416739 0.661961 -0.825505
C  2.203717 -1.150271 -0.018782
C  -1.823333 0.315394 -0.417058
C  -2.124196 -1.008721 -0.001597
C  -2.849739 1.290636 -0.442895
C  -3.440096 -1.349054 0.375367
C  -4.169882 0.946593 -0.071778
C  -4.46636 -0.373653 0.337024
H  4.614259 0.5814 -1.06334
H  4.788545 0.474553 0.721292
H  -0.010028 -0.053719 -1.562305
H  -0.319204 1.696979 -1.197467
H  4.147855 -1.91839 -0.272958
H  -1.318954 -1.752144 0.036756
H  -2.616588 2.317606 -0.749635
H  -3.668339 -2.370887 0.698083
H  -4.960574 1.704512 -0.096779
H  -5.488748 -0.641058 0.627368
