program: Gaussian 09
title: 000005523
version: EM64L-G09RevD.01
frameworkgroup: C1[X(C16H25NO2)]
method: RPBEPBE
basis: SDD
operation: Freq
keyword: #p
keyword: freq=noraman
keyword: PBEPBE/SDD
title: #p freq=noraman PBEPBE/SDD
converged: YES YES NO NO
title: Mulliken charges:
elementType: O O N C C C C C C C C C C C C C C C C H H H H H H H H H H H H H H H H H H H H H H H H H
charge: -0.466997 -0.272594 -0.085276 -0.117531 0.166847 -0.417878 -0.486838 -0.409680 -0.392710 -0.429042 0.418062 -0.566067 -0.414800 -0.621524 -0.621198 0.345743 -0.236220 -0.390869 -0.536916 0.191718 0.228880 0.195100 0.228650 0.213633 0.184072 0.201020 0.225030 0.193314 0.220869 0.192596 0.333497 0.289771 0.223081 0.221956 0.191287 0.219961 0.227322 0.219658 0.187575 0.220729 0.241988 0.244530 0.218843 0.220410
chargesum: 0.00000
title: Mulliken charges with hydrogens summed into heavy atoms:
elementType: O O N C C C C C C C C C C C C C C C C
charge: -0.133500 -0.272594 -0.085276 0.074187 0.166847 0.006101 -0.044555 -0.024588 0.025633 -0.015577 0.418062 -0.276296 -0.191719 0.011680 0.013356 0.345743 -0.015491 -0.148881 0.146867
polarizability: 2.29615733e+02 -1.30927497e+01 1.66003522e+02 6.11498890e+00 9.52142922e+00 1.61259064e+02
1716.lowfreq: -8.7591 -0.0005 -0.0005 -0.0003 7.3444 12.8967 19.3789 23.9908 46.5776
frequency: 17.9562 22.3189 46.5616 77.8169 88.1404 102.6340 113.6632 163.1017 182.5754 199.3744 203.1202 215.6262 230.7385 244.5469 255.3244 267.3625 274.1734 305.3303 314.1600 321.2509 343.2270 379.8255 381.8246 408.0979 438.0987 451.6378 461.6419 494.6696 530.1499 548.8649 555.2806 622.0586 637.9423 698.9241 706.1840 775.3025 783.4098 795.2826 821.0537 833.9587 863.0433 878.2235 887.6476 919.5931 925.4051 940.5613 963.5093 968.1944 978.7633 985.7956 1017.0723 1026.9785 1034.1773 1053.5640 1066.9546 1079.7385 1092.3904 1093.6090 1102.7390 1111.2722 1111.7125 1133.5046 1142.3804 1152.4275 1161.4509 1180.9070 1186.5488 1212.6520 1239.3720 1250.4205 1257.9122 1265.7026 1273.2289 1282.7445 1288.8119 1303.7548 1323.6019 1336.9109 1338.1695 1345.3520 1349.1683 1368.6204 1390.1888 1417.7967 1426.0190 1440.3970 1441.2027 1447.8892 1457.5937 1459.7399 1465.3286 1467.4931 1467.5414 1472.2018 1473.0287 1474.2792 1474.4779 1478.8582 1485.8779 1584.1013 1616.1883 2845.1870 2850.1849 2864.9017 2957.1880 2957.3394 2973.1252 2980.5134 2982.7311 2989.9103 2995.8231 3015.9903 3024.7671 3026.2040 3043.8807 3044.1357 3052.5475 3059.2417 3074.5423 3080.6960 3122.8737 3124.7207 3146.3111 3163.7573 3166.6167 3543.3998
redmass: 2.5087 4.4957 3.5004 2.9402 3.1608 3.4473 3.2584 3.6574 1.8683 1.4816 1.7313 2.4796 2.4118 1.9765 2.5083 1.6060 3.1538 2.5873 2.5972 1.3919 1.9027 2.7018 1.9785 3.3677 2.3620 2.7095 3.1665 3.0113 3.7470 4.1135 2.6396 4.4344 4.7421 3.7242 2.0518 3.8431 1.6738 2.0505 2.6173 2.7955 1.9615 1.5880 1.7838 1.5167 2.1801 2.0252 1.3692 2.0637 3.4775 3.6848 2.8296 2.1106 1.6255 1.8303 1.6118 1.7280 1.5637 1.7684 1.6457 1.6340 1.3391 1.5988 1.7720 1.7184 1.4336 1.8172 1.2282 1.8590 2.8944 1.6507 1.8301 1.6190 1.4302 1.3907 1.4131 1.2530 1.4839 1.4113 1.4220 1.6182 1.5004 1.3713 7.3263 1.1418 1.8638 1.1648 1.5335 1.1114 1.0810 1.0523 1.0540 1.0851 1.0520 2.0848 1.0956 1.0766 1.0936 1.0874 1.0591 6.0200 6.8606 1.0578 1.0636 1.0608 1.0420 1.0544 1.0766 1.0687 1.0615 1.0655 1.0845 1.0722 1.0720 1.0959 1.0996 1.1037 1.1003 1.1021 1.1009 1.1003 1.0982 1.0867 1.0928 1.0911 1.0958 1.0655
irintensity: 0.3726 0.0143 0.2968 4.3586 1.4635 2.3694 0.6517 0.2052 0.3423 0.2355 1.0691 2.8816 0.6603 2.7866 2.0563 1.4822 27.3868 12.5371 15.4734 67.1904 53.0162 19.2428 0.9806 0.9678 1.8235 3.8668 0.9562 6.2399 4.8852 5.8171 8.0373 0.8579 4.7796 14.0962 30.1558 11.9929 51.1550 3.4886 17.0134 3.0414 14.5830 5.7691 9.4660 18.9005 12.4494 18.8269 2.5198 17.7374 21.1854 20.4374 52.7993 36.9052 13.5535 5.0424 20.9454 6.5275 1.1905 4.1974 7.4848 12.5422 5.0885 12.0305 7.5261 1.5885 13.7895 22.0773 1.4301 17.9521 129.9006 12.7553 18.9686 18.0235 23.3785 6.5961 6.3276 6.4350 8.1144 2.4424 1.0853 2.0568 2.0636 7.4753 13.1977 2.6088 53.0949 1.4153 8.2969 6.9045 10.3208 14.3747 6.3608 17.2568 10.1620 55.1783 25.7951 14.7536 15.3355 11.5553 8.0046 59.5300 93.6253 77.0742 48.0918 211.1018 94.8373 20.4661 2.3084 5.2457 24.8697 37.1609 66.9531 43.6747 42.6288 81.8691 19.0678 63.3558 7.8582 61.6118 26.2569 58.8389 26.4363 7.1552 23.8573 1.2463 16.0037 4.2623
temp: 298.150 k
press: 1.00000 atm
elementType: 8 8 7 6 6 6 6 6 6 6 6 6 6 6 6 6 6 6 6 1 1 1 1 1 1 1 1 1 1 1 1 1 1 1 1 1 1 1 1 1 1 1 1 1
symmnumber: 1
zpe: 997892.4 jmol-1
zpe.correction: 0.380077 hartree
zpe.thermalcorrener: 0.400024 hartree
zpe.thermalcorrenthalpy: 0.400968 hartree
zpe.thermalcorrgfe: 0.331117 hartree
zpe.sumelectzpe: -828.383182 hartree
zpe.sumelectthermal: -828.363236 hartree
zpe.sumelectthermalent: -828.362291 hartree
zpe.sumelectthermalfe: -828.432142 hartree
dipole: -1.7046 2.7608 1.2551
dipole: 3.4790
quadrupole: -102.8677 -116.5103 -113.1134
quadrupole: -3.6371 -1.8800 -2.1643
quadrupole: 7.9628 -5.6799 -2.2829 -3.6371 -1.8800 -2.1643
hfenergy: -828.7632592 hartree
pointgroup: C01 [X(C16H25N1O2)]
dipole: 0.6443864 -1.1031861 0.4910851 debye
polarizability: 229.1705748|-14.2306089|166.6983649|-5.8177986|-9.4802431|161.0093798 unknown
InChI: InChI=1S/C16H25NO2/c1-17(2)12-14-7-4-5-10-16(14,18)13-8-6-9-15(11-13)19-3/h6,8-9,11,14,18H,4-5,7,10,12H2,1-3H3
charge 0 multiplicity 1
44 atoms
O  -0.463117 1.401788 -1.607817
O  4.198398 -0.035543 -1.040026
N  -2.774248 -2.154868 -0.231852
C  -1.803858 0.158476 0.086441
C  -0.536432 1.048079 -0.165412
C  -3.100885 0.923705 -0.268818
C  -0.67514 2.415263 0.560965
C  -3.21766 2.258284 0.498714
C  -1.987847 3.151109 0.215563
C  -1.735748 -1.190385 -0.676349
C  0.773908 0.367592 0.283535
C  1.920589 0.430886 -0.535678
C  0.872197 -0.283964 1.545657
C  -2.459356 -2.781869 1.067734
C  -3.082645 -3.167476 -1.261864
C  3.13969 -0.162719 -0.124164
C  2.088686 -0.865459 1.952268
C  3.23593 -0.820465 1.125225
C  5.486298 -0.626215 -0.671593
H  -1.829652 -0.053696 1.174786
H  -3.960886 0.260909 -0.061102
H  -3.099058 1.136194 -1.357026
H  0.202845 3.031283 0.291565
H  -0.621191 2.229709 1.652006
H  -3.287605 2.057159 1.589107
H  -4.148343 2.78408 0.210031
H  -1.972917 3.424691 -0.856153
H  -2.044089 4.091983 0.797306
H  -0.710648 -1.632762 -0.587672
H  -1.917831 -0.994192 -1.752869
H  -0.33532 0.567286 -2.128141
H  1.889719 0.95933 -1.49297
H  0.004283 -0.339711 2.211358
H  -2.338443 -2.011816 1.848859
H  -1.522472 -3.395639 1.042167
H  -3.294014 -3.438722 1.371941
H  -3.409106 -2.667254 -2.190949
H  -3.91092 -3.810791 -0.912839
H  -2.215731 -3.832079 -1.511177
H  2.152121 -1.365632 2.925589
H  4.168938 -1.283581 1.459461
H  6.154632 -0.407964 -1.51758
H  5.403868 -1.722554 -0.535372
H  5.892258 -0.16825 0.251645
