program: Gaussian 09
title: 000005560
version: EM64L-G09RevD.01
frameworkgroup: C1[X(C8H8Cl3N3O4S2)]
method: RPBEPBE
basis: SDD
operation: Freq
keyword: #p
keyword: freq=noraman
keyword: PBEPBE/SDD
title: #p freq=noraman PBEPBE/SDD
converged: YES YES NO NO
title: Mulliken charges:
elementType: Cl Cl Cl S S O O O O N N N C C C C C C C C H H H H H H H H
charge: 0.039049 0.049242 0.017920 0.954300 0.953430 -0.486082 -0.493539 -0.503949 -0.534185 -0.439193 -0.409570 -0.710051 -0.069572 -0.315576 0.655190 -0.241459 -0.018299 -0.647626 -0.376207 -0.077223 0.343951 0.314378 0.326469 0.337007 0.372133 0.271932 0.348143 0.339386
chargesum: 0.00000
title: Mulliken charges with hydrogens summed into heavy atoms:
elementType: Cl Cl Cl S S O O O O N N N C C C C C C C C
charge: 0.039049 0.049242 0.017920 0.954300 0.953430 -0.486082 -0.493539 -0.503949 -0.534185 -0.124815 -0.083101 -0.022522 0.274379 -0.315576 0.655190 0.095548 -0.018299 -0.275492 -0.104274 -0.077223
polarizability: 2.80130122e+02 2.88189917e+00 2.06790358e+02 -7.74932681e+00 4.08411050e+00 1.44449815e+02
1716.lowfreq: -5.6543 -3.3374 -0.0029 -0.0025 -0.0023 5.3266 22.6440 37.3219 48.1503
frequency: 22.5801 37.3191 48.1333 61.9117 78.6551 91.7073 112.1314 116.6004 122.3717 146.6275 158.1258 170.3863 179.6157 206.3930 216.4311 218.5475 252.3507 268.0460 277.0209 284.0607 294.4036 316.3163 346.7966 375.7175 392.2241 394.5197 427.7973 445.9384 463.4909 473.3740 484.6448 489.2697 498.6258 565.6050 581.3690 646.2224 649.2640 670.8650 693.0605 727.8598 735.0065 783.4045 786.6408 807.5656 836.7410 874.8177 881.2255 916.1765 929.8254 947.8259 988.7938 1004.3275 1072.6797 1078.3733 1100.2680 1102.7861 1175.4610 1219.7248 1232.6059 1249.0788 1276.8941 1302.2710 1336.4279 1363.4992 1416.2667 1450.2000 1487.7927 1527.3384 1552.5066 1606.1006 2966.8148 3123.1966 3157.7956 3162.7825 3377.8827 3378.8893 3524.4628 3549.4804
redmass: 12.7675 13.4851 8.2714 12.9390 11.1117 10.5865 9.6366 6.9439 1.7757 4.8773 15.2299 12.8784 11.3043 8.6783 11.6436 6.2700 6.6353 4.3309 8.3977 5.8904 9.3050 8.9800 6.4046 11.6772 8.5139 5.6991 11.2829 2.7601 4.2007 4.6560 3.1145 2.0461 7.8643 6.6432 3.9354 9.3836 5.9485 3.0785 6.0104 6.7637 2.3853 3.0837 1.7717 12.4275 8.5884 2.3028 3.6534 4.0190 1.4150 5.1938 6.7842 6.1894 1.8640 2.7858 2.0752 3.3496 1.0902 1.2587 1.2257 1.3004 1.9756 2.6689 1.5452 1.2640 6.5568 2.2888 3.2193 1.0857 5.2587 8.0163 1.0823 1.0920 1.0925 1.0895 1.0753 1.0413 1.0774 1.1012
irintensity: 0.2809 1.1978 2.9753 4.7184 1.2772 2.8435 0.6772 0.9241 22.1187 4.2371 0.2956 1.8549 0.6420 2.2488 9.7030 7.6744 1.4926 3.5294 1.5540 4.4973 6.1503 2.8344 14.9767 1.7965 96.2860 24.1349 59.1725 37.6624 127.0950 53.7672 33.1638 23.6881 32.1307 136.1017 57.1365 6.1713 3.2645 25.4255 102.2719 29.1280 5.1944 52.1663 162.3601 48.7327 155.8854 22.7556 60.0136 62.2223 12.5579 100.1153 63.5541 7.3076 11.1735 30.0603 15.6702 39.7043 2.5060 32.9261 63.0753 20.3909 19.7640 7.5968 47.0789 25.7662 6.7480 11.0446 223.2170 33.8382 66.4217 295.8107 26.1603 25.4867 1.1492 0.4132 35.8221 36.1649 96.6048 30.2339
temp: 298.150 k
press: 1.00000 atm
elementType: 17 17 17 16 16 8 8 8 8 7 7 7 6 6 6 6 6 6 6 6 1 1 1 1 1 1 1 1
symmnumber: 1
zpe: 438373.4 jmol-1
zpe.correction: 0.166968 hartree
zpe.thermalcorrener: 0.188619 hartree
zpe.thermalcorrenthalpy: 0.189563 hartree
zpe.thermalcorrgfe: 0.114865 hartree
zpe.sumelectzpe: -2949.228962 hartree
zpe.sumelectthermal: -2949.207310 hartree
zpe.sumelectthermalent: -2949.206366 hartree
zpe.sumelectthermalfe: -2949.281065 hartree
dipole: 2.5587 -5.7612 -2.3122
dipole: 6.7145
quadrupole: -147.3716 -170.7130 -161.0052
quadrupole: 1.6856 17.6149 3.4436
quadrupole: 12.3250 -11.0164 -1.3086 1.6856 17.6149 3.4436
hfenergy: -2949.3959296 hartree
pointgroup: C01 [X(C8H8Cl3N3O4S2)]
dipole: -0.9451281 -2.2326251 1.0490727 debye
polarizability: 280.5678979|-0.212009|205.702478|-3.6496889|-8.899148|145.09992 unknown
InChI: InChI=1S/C8H8Cl3N3O4S2/c9-3-1-4-6(2-5(3)19(12,15)16)20(17,18)14-8(13-4)7(10)11/h1-2,7-8,13-14H,12H2
charge 0 multiplicity 1
28 atoms
Cl -4.934229 -1.865649 1.112217
Cl -4.377134 -1.259179 -1.83512
Cl 2.788137 -2.816729 0.413055
S  -1.344993 2.1405 0.043924
S  3.935063 0.344253 -0.174288
O  -0.860675 3.232325 -1.041095
O  -1.812286 2.549118 1.540335
O  4.617834 -0.610495 -1.292583
O  3.944874 1.967698 -0.295122
N  -2.823487 1.187579 -0.644109
N  -2.030441 -0.922256 0.365509
N  4.640865 -0.050883 1.465544
C  -3.108931 0.089612 0.28898
C  -0.154802 0.691754 0.102098
C  -0.678902 -0.627122 0.292076
C  1.213355 0.959637 -0.028081
C  2.116486 -0.109002 0.047038
C  -4.451372 -0.535505 -0.117639
C  0.278852 -1.684771 0.373877
C  1.6486 -1.421459 0.262592
H  -3.26791 0.564808 1.281561
H  -2.604163 0.883575 -1.611824
H  -2.311117 -1.882461 0.579475
H  1.594295 1.975618 -0.19693
H  -5.250339 0.213906 -0.114474
H  -0.062282 -2.713976 0.523303
H  5.087549 0.803091 1.837469
H  5.277152 -0.858387 1.375411
