program: Gaussian 09
title: 000034830
version: EM64L-G09RevD.01
frameworkgroup: C1[X(C11H10O3S)]
method: RPBEPBE
basis: SDD
operation: Freq
keyword: #p
keyword: freq=noraman
keyword: PBEPBE/SDD
title: #p freq=noraman PBEPBE/SDD
converged: YES YES NO NO
title: Mulliken charges:
elementType: S O O O C C C C C C C C C C C H H H H H H H H H H
charge: 0.266370 -0.270416 -0.416383 -0.214052 0.466773 0.515106 -0.434895 -0.621895 -0.537315 -0.741656 -0.264366 0.342916 -0.374717 0.210050 -0.538001 0.252530 0.243300 0.292008 0.274695 0.240743 0.244411 0.245287 0.220030 0.219924 0.379554
chargesum: 0.00000
title: Mulliken charges with hydrogens summed into heavy atoms:
elementType: S O O O C C C C C C C C C C C
charge: 0.266370 -0.270416 -0.036829 -0.214052 0.466773 0.515106 -0.434895 -0.126065 -0.245307 -0.466961 -0.023623 0.342916 -0.130306 0.210050 0.147240
polarizability: 1.91727965e+02 -2.10936870e+01 1.63308931e+02 7.13764852e+00 8.58071429e+00 7.87307253e+01
1716.lowfreq: -6.5520 -4.3442 -0.0019 -0.0019 -0.0010 5.5128 19.8573 50.9247 72.0028
frequency: 19.5139 50.8966 71.9978 76.9611 125.9268 152.9874 186.2837 233.3878 237.3357 268.6495 335.0950 343.6707 371.6555 402.7815 427.3967 469.2460 508.2059 527.6258 536.9890 554.8121 605.6709 628.4805 655.6985 702.6440 720.0714 750.3154 778.7742 796.1416 799.2738 853.5188 866.6343 893.9611 930.0206 931.2169 1001.4260 1019.4976 1051.9922 1080.9742 1112.1395 1141.6537 1165.4550 1168.7346 1184.3681 1213.4732 1263.5939 1275.0734 1318.2376 1337.9199 1391.7622 1427.9569 1448.1193 1451.2263 1453.7133 1468.2944 1475.7193 1544.3168 1574.3290 1617.4963 1672.1596 2957.3143 3026.3163 3044.1204 3092.8334 3123.6011 3145.5727 3165.2617 3170.7818 3222.5046 3507.3440
redmass: 9.2770 6.7844 4.7350 4.1110 5.2217 4.1554 4.9994 1.7804 1.9949 3.9072 5.5995 8.4474 5.2779 2.4428 3.1302 3.8364 3.7855 6.7691 4.4111 3.8793 5.1443 2.2784 2.0045 4.6416 4.3057 5.3591 1.5163 2.0344 2.2339 5.0508 4.3247 1.6616 1.6838 1.5942 4.2096 6.2916 2.1119 2.5768 1.2581 1.4554 1.3807 1.2446 1.4434 2.4033 1.4097 1.5898 1.8177 2.7425 8.1132 1.5712 1.3107 2.1308 2.0032 1.0504 1.1128 5.9156 7.8739 7.0302 8.7252 1.0331 1.0588 1.1039 1.1036 1.0991 1.0886 1.0924 1.0952 1.0961 1.0639
irintensity: 1.4930 0.4837 4.9040 1.5409 2.0547 2.1383 0.4008 1.2047 1.4845 0.3735 5.0339 0.5103 0.9976 3.2232 5.4900 8.5006 5.4363 1.9005 13.1178 36.8396 22.1860 70.3306 104.7193 7.4279 8.4339 2.0913 41.4591 31.2750 10.6865 2.4925 9.9845 33.6718 7.9418 6.2330 72.6475 10.1517 183.2451 55.1449 0.1985 3.7487 30.2225 11.6703 15.9683 120.6744 39.0164 11.2084 39.1377 24.4819 11.0336 72.7595 45.6889 12.9786 36.1723 13.0082 18.4017 22.0395 22.7569 62.1580 230.8183 74.9050 13.1950 50.5917 4.0888 25.3304 3.5033 0.3306 13.4154 1.2519 21.5061
temp: 298.150 k
press: 1.00000 atm
elementType: 16 8 8 8 6 6 6 6 6 6 6 6 6 6 6 1 1 1 1 1 1 1 1 1 1
symmnumber: 1
zpe: 485259.9 jmol-1
zpe.correction: 0.184826 hartree
zpe.thermalcorrener: 0.198684 hartree
zpe.thermalcorrenthalpy: 0.199628 hartree
zpe.thermalcorrgfe: 0.142492 hartree
zpe.sumelectzpe: -1047.816190 hartree
zpe.sumelectthermal: -1047.802332 hartree
zpe.sumelectthermalent: -1047.801388 hartree
zpe.sumelectthermalfe: -1047.858524 hartree
dipole: 2.7252 -0.5578 -0.7479
dipole: 2.8804
quadrupole: -79.3476 -88.9723 -98.2824
quadrupole: -0.0226 9.9405 -0.6984
quadrupole: 9.5199 -0.1049 -9.4149 -0.0226 9.9405 -0.6984
hfenergy: -1048.0010162 hartree
pointgroup: C01 [X(C11H10O3S1)]
dipole: 1.0144852 0.4153217 0.287397 debye
dipolederiv: -0.2643841 0.1276247 0.0679671 -0.0431244 -0.3343539 -0.0407594 0.0772531 -0.112063 0.0797899 -1.0439688 -0.6243402 0.023755 -0.9312625 -1.0763176 0.0289009 -0.0142203 -0.014691 -0.2975383 -0.518711 -0.2016555 -0.0062045 -0.1779114 -1.0780272 -0.1804072 -0.0029612 -0.0320041 -0.2737572 -0.6358292 -0.1189495 -0.2379105 0.0189151 -0.5483243 0.0628911 -0.4819376 0.0167821 -0.6825859 0.1228975 0.2677505 0.0347098 0.0660726 -0.0365864 -0.007519 -0.0102439 -0.0626401 0.0251363 0.1766589 -0.2534507 -0.0340732 -0.1097296 -0.1040697 -0.0379182 -0.0837683 0.0686798 -0.0941392 -0.0364063 0.3569867 0.0386426 0.3550665 0.212104 0.0004559 0.0374489 -0.0085757 -0.1499538 0.0371341 0.0494932 -0.0726261 0.1345225 -0.1633376 0.1467841 -0.0600236 0.0986135 0.0052281 -0.2561783 -0.341195 -0.0490521 -0.0975603 -0.1718026 0.0053122 0.0014333 0.0561948 -0.1654177 -0.029758 -0.3404854 -0.113791 -0.2479068 0.309435 0.1491004 -0.0762578 0.2039315 -0.2250634 0.1714393 -0.099072 -0.0711887 -0.0107298 0.0083366 0.0252255 -0.0568761 0.0395235 -0.0782326 0.5187995 0.6056426 0.0338909 0.9769736 1.0628145 0.0026828 0.0871409 0.0491424 0.082208 -0.1039722 0.0284372 -0.0236761 -0.2827041 -0.2359281 0.0480454 -0.0753947 -0.0080184 -0.2032158 0.7123019 0.354264 0.4395792 0.1732785 1.3228713 -0.0877001 0.7281716 -0.2427785 0.8118624 0.8506425 0.3677987 -0.0292522 0.070469 0.2650579 -0.0244021 -0.0956308 -0.086352 0.3295915 0.0753847 -0.0185555 -0.0713079 0.0288208 -0.0009028 -0.0912261 -0.0308217 -0.0507455 0.0071162 -0.0510878 -0.0159898 0.0515466 -0.089952 0.0533279 0.0499421 -0.0072362 0.0228764 0.0838957 0.1171108 0.0331597 0.034847 0.0192368 0.0291798 -0.0261631 0.0348223 -0.0297214 0.1576173 -0.0105543 -0.0243788 0.0409385 0.0028399 0.0968717 -0.0239943 0.0374129 -0.0163326 0.1817279 0.0523973 0.0383787 0.0279324 0.0759517 -0.0303105 -0.0496515 0.0358904 -0.0432961 0.1450617 -0.0959495 -0.0250886 0.0475642 -0.0271228 0.1020419 -0.0064349 0.0506076 -0.0071622 0.1596946 0.0474586 -0.0582818 0.0037933 -0.1192339 -0.1287743 -0.0221098 -0.005956 -0.0323365 0.1177259 -0.0481455 -0.0699743 0.0272009 0.079522 0.0931592 -0.0952906 0.1031947 -0.0124303 -0.146552 -0.1067033 -0.0298586 -0.0563794 0.1564004 0.035832 0.1059611 -0.0674459 0.0893802 -0.0309746 0.3194233 -0.0082602 -0.1069058 -0.0208318 0.3177032 0.0682746 -0.1246017 0.1140233 0.160775 unknown
polarizability: 183.049241|24.7740016|172.0111419|-9.1791265|6.3750028|78.7072386 unknown
InChI: InChI=1S/C11H10O3S/c1-14-8-2-3-10-9(5-8)7(6-15-10)4-11(12)13/h2-3,5-6,12H,4H2,1H3
charge 0 multiplicity 1
25 atoms
S  -0.448168 -3.203221 -0.138373
O  2.614156 1.956793 0.17208
O  -2.242118 2.430933 -0.069794
O  -3.592986 0.895525 -1.173585
C  -0.070669 -0.566672 0.2685
C  -1.486984 -0.824214 0.52344
C  0.645323 -1.75156 -0.098967
C  -2.476621 0.247541 0.946053
C  0.627797 0.662942 0.346178
C  -1.827848 -2.148026 0.348312
C  2.022351 -1.724736 -0.377806
C  2.010787 0.690715 0.067834
C  2.712251 -0.496078 -0.293369
C  -2.850885 1.172281 -0.209846
C  4.047119 2.053489 -0.109965
H  -2.062044 0.855201 1.768174
H  -3.409633 -0.226447 1.295379
H  0.116759 1.595031 0.604491
H  -2.810501 -2.604128 0.462859
H  2.562167 -2.635291 -0.65653
H  3.783948 -0.472152 -0.509672
H  4.294853 3.116117 0.029275
H  4.276637 1.751814 -1.150844
H  4.641429 1.438539 0.594131
H  -2.478818 3.003005 -0.850155
