program: Gaussian 09
title: 000034778
version: EM64L-G09RevD.01
frameworkgroup: C1[X(C10H10S)]
method: RPBEPBE
basis: SDD
operation: Freq
keyword: #pfreq=noraman
keyword: PBEPBE/SDD
title: #p freq=noraman PBEPBE/SDD
converged: NO YES NO NO
title: Mulliken charges:
elementType: S C C C C C C C C C C H H H H H H H H H H
charge: 0.251196 0.305527 0.431582 0.360903 -0.388183 -0.730239 -0.434076 -0.287687 -0.795653 -0.813972 -0.236127 0.269885 0.226351 0.244402 0.231032 0.225985 0.225984 0.225739 0.225740 0.233473 0.228138
chargesum: 0.00000
title: Mulliken charges with hydrogens summed into heavy atoms:
elementType: S C C C C C C C C C C
charge: 0.251196 0.305527 0.431582 0.360903 -0.388183 -0.460354 -0.207726 -0.043284 -0.112651 -0.129020 -0.007989
polarizability: 1.59510592e+02 3.45822684e+00 1.42248992e+02 -9.65211397e-03 6.18797656e-03 5.65012639e+01
1716.lowfreq: -16.7399 -6.4619 0.0010 0.0019 0.0026 3.1738 75.3951 121.9058 195.4912
frequency: 75.3701 121.8820 195.4874 219.7504 248.8381 262.0299 263.5326 300.6369 389.4858 464.9804 466.3454 506.9328 523.1697 549.4961 597.9021 598.1300 736.8417 746.6852 769.7548 785.5176 801.2815 867.1041 897.6720 968.7377 987.3539 1003.3017 1031.9407 1045.8794 1056.4470 1097.9629 1145.8488 1178.4470 1188.2791 1256.2286 1336.6992 1373.8027 1391.2169 1403.4193 1407.1352 1459.5751 1461.9230 1463.2330 1483.1603 1487.7697 1544.6354 1574.1038 1598.6687 2980.3962 2987.1737 3061.0690 3070.6701 3082.0590 3087.3373 3124.4616 3141.8878 3162.8671 3219.7574
redmass: 2.5634 1.1382 3.1312 3.1791 2.0492 3.2634 1.5598 2.9354 6.4670 4.7707 3.5943 7.0083 3.8950 4.7920 4.9534 3.2312 6.3885 2.6910 1.2217 1.6115 4.3888 4.4929 1.3259 1.3364 1.7281 1.5907 1.5014 1.5539 3.1263 1.8479 2.2855 1.3625 1.4688 1.8020 3.0295 4.6032 1.2480 1.3186 2.6170 2.3154 1.0475 1.3390 1.0466 1.1349 4.4939 6.7988 6.2679 1.0370 1.0364 1.0981 1.0976 1.0992 1.0981 1.0870 1.0907 1.0995 1.0956
irintensity: 0.0156 0.1847 0.0004 13.4183 0.6090 1.1344 0.0006 1.2808 1.3335 0.7227 0.0135 0.1583 0.0601 1.1705 2.2286 0.0029 0.6182 1.9905 107.4587 5.1130 14.2246 15.9373 0.0395 0.7924 3.1911 5.5050 0.0010 13.1136 12.0359 6.3393 5.5482 5.1524 1.5637 2.3379 4.3546 3.2372 3.4347 23.0050 2.3445 21.3477 0.0229 37.1857 32.9286 3.4170 2.8178 5.1145 5.9404 3.8612 62.2365 0.0111 39.9360 47.5026 0.5419 11.2534 12.4701 24.4292 1.7132
temp: 298.150 k
press: 1.00000 atm
elementType: 16 6 6 6 6 6 6 6 6 6 6 1 1 1 1 1 1 1 1 1 1
symmnumber: 1
zpe: 438145.9 jmol-1
zpe.correction: 0.166881 hartree
zpe.thermalcorrener: 0.176835 hartree
zpe.thermalcorrenthalpy: 0.177779 hartree
zpe.thermalcorrgfe: 0.131759 hartree
zpe.sumelectzpe: -784.346677 hartree
zpe.sumelectthermal: -784.336723 hartree
zpe.sumelectthermalent: -784.335779 hartree
zpe.sumelectthermalfe: -784.381798 hartree
dipole: -0.7438 1.5788 0.0002
dipole: 1.7452
quadrupole: -66.5268 -64.4358 -77.3909
quadrupole: 2.7949 -0.0009 0.0006
quadrupole: 2.9243 5.0153 -7.9397 2.7949 -0.0009 0.0006
hfenergy: -784.5135579 hartree
pointgroup: C01 [X(C10H10S1)]
dipole: -0.0562447 0.6843257 -0.0000933 debye
dipolederiv: -0.254182 0.0700827 0.0000069 -0.1357771 -0.348327 0.000054 0.0000257 0.0000428 0.0898446 0.1022696 0.1173894 -0.0000172 -0.066399 -0.3692198 0.0000404 0.0000044 0.0000324 -0.0113911 0.0258442 -0.2016681 0.0000192 -0.1188549 0.0338648 0.0000017 0.0000081 0.0000079 -0.0255003 0.0594681 -0.1399443 0.0000109 -0.0170684 0.3404859 -0.0000431 -0.0000019 -0.000046 -0.0207876 0.3386993 0.3287689 -0.0000529 0.3548064 0.1146255 -0.0000382 -0.0000562 -0.0000347 -0.1085522 -0.1348973 -0.2798421 0.0000271 -0.0644359 0.3812827 -0.0000754 0.0000027 -0.0000662 -0.325932 -0.0156981 0.2100567 -0.000033 0.0564343 -0.1291374 -0.0000103 -0.0000115 -0.0000171 -0.1940292 -0.136769 -0.1118342 0.00001 -0.1260558 -0.010362 -0.000006 0.0000122 -0.0000026 -0.1416546 0.0414659 0.0108721 0.0000025 0.0456302 -0.0581404 0.0000125 -0.0000023 0.0000107 0.084554 0.0480335 0.0875609 -0.0000066 0.0200007 -0.1186313 0.0000215 -0.0000006 0.0000286 0.0635229 0.0272093 -0.039556 -0.0000088 0.0481027 0.1190077 -0.0000339 -0.0000216 -0.0000301 -0.1579627 -0.0378974 0.0095108 0.0000075 0.0432308 0.0733314 0.0000129 0.0000034 0.0000135 0.2070184 -0.0340871 -0.0985325 0.0000211 -0.1343126 -0.030865 0.0000277 0.0000221 0.0000247 0.1534621 0.0824391 0.0007945 0.0000043 0.056227 -0.0744516 0.0000232 -0.0000002 0.0000222 0.1670104 -0.1636452 0.0247909 0.0000072 -0.0924252 0.073941 0.0000072 0.0000199 0.0000033 0.1122614 0.0967819 -0.0146037 -0.0769181 0.0304619 -0.0419797 -0.0853583 -0.0322847 -0.1156939 -0.0411743 0.0967923 -0.0145806 0.0769098 0.0304753 -0.0419401 0.0853565 0.0322674 0.1156962 -0.0412228 0.0466721 0.0701825 -0.1134705 0.0306512 0.0025185 0.02447 -0.0998242 0.0786478 -0.0403796 0.0466834 0.0702054 0.1134495 0.0306757 0.0024993 -0.0244813 0.0998125 -0.0786608 -0.0403607 -0.1160962 -0.1677024 0.0000234 -0.0471576 0.0193271 0.0000103 0.0000123 0.0000137 0.1084673 -0.1190865 0.0680491 0.000008 0.0557901 0.0621705 0.0000083 0.0000126 0.0000078 0.1628062 unknown
polarizability: 158.2053268|5.7259565|143.5542571|-0.0052785|-0.010178|56.5012639 unknown
InChI: InChI=1S/C10H10S/c1-7-4-3-5-9-10(7)8(2)6-11-9/h3-6H,1-2H3
charge 0 multiplicity 1
21 atoms
S  -1.315775 -2.285923 0.000296
C  -0.181666 0.168374 -0.000018
C  -1.63745 0.380462 0.000017
C  0.894014 1.121521 -0.000183
C  0.156728 -1.227653 0.000127
C  -2.342229 -0.805892 0.000173
C  2.218879 0.631235 -0.000198
C  1.481737 -1.705774 0.000115
C  -2.359117 1.713473 -0.000091
C  0.673844 2.626714 -0.000355
C  2.52007 -0.756035 -0.000048
H  -3.424693 -0.928172 0.00022
H  3.043952 1.353348 -0.000323
H  1.697213 -2.779002 0.000215
H  -3.451774 1.55929 -0.000039
H  -2.108122 2.317285 0.890631
H  -2.108185 2.317116 -0.890948
H  0.111457 2.963714 -0.889954
H  0.111479 2.96393 0.88917
H  1.642707 3.154271 -0.000436
H  3.564229 -1.086682 -0.000072
