program: Gaussian 09
title: 000034832
version: EM64L-G09RevD.01
frameworkgroup: C1[X(C12H20S)]
method: RPBEPBE
basis: SDD
operation: Freq
keyword: #pfreq=noraman
keyword: PBEPBE/SDD
title: #p freq=noraman PBEPBE/SDD
converged: YES YES NO NO
title: Mulliken charges:
elementType: S C C C C C C C C C C C C H H H H H H H H H H H H H H H H H H H H
charge: 0.217777 0.138949 0.184265 0.608429 -0.464807 -0.740314 -0.728880 -0.725130 -0.707392 -0.716426 -0.721763 -0.225480 -0.589035 0.215134 0.210316 0.226179 0.220532 0.206640 0.248151 0.207502 0.219149 0.212921 0.207146 0.245928 0.221901 0.215078 0.209834 0.220892 0.212479 0.225277 0.231672 0.251299 0.261777
chargesum: 0.00000
title: Mulliken charges with hydrogens summed into heavy atoms:
elementType: S C C C C C C C C C C C C
charge: 0.217777 0.138949 0.184265 0.608429 -0.464807 -0.088686 -0.053556 -0.085558 -0.032416 -0.070623 -0.052335 0.025819 -0.327258
polarizability: 1.65709625e+02 1.53489703e+00 1.56262661e+02 8.05586628e-01 3.22111698e-01 1.04396863e+02
1716.lowfreq: -22.7071 -12.4674 -6.1685 -0.0020 -0.0019 -0.0013 38.1416 94.9836 122.3665
frequency: 37.7229 94.9375 122.3307 155.3836 172.5377 182.3099 222.6322 235.7040 248.8815 263.0396 270.6741 275.4666 288.9141 312.6990 323.9366 353.6849 363.9203 379.1178 405.4471 425.9651 445.5400 469.0147 521.6897 532.9533 564.4001 654.6575 672.0657 737.1911 753.3027 800.3242 818.5481 864.1837 882.8676 914.6733 917.0180 923.5963 926.7536 939.5775 949.1850 1001.7042 1021.3647 1024.4927 1026.6423 1029.0381 1109.6386 1151.4706 1195.4018 1198.1322 1204.9362 1213.4097 1230.9303 1247.2928 1344.7650 1369.2919 1373.6277 1374.4501 1378.8674 1399.6200 1403.1489 1431.7325 1452.6135 1458.7476 1463.3523 1466.4620 1472.9870 1476.0665 1477.1110 1484.9037 1488.3874 1497.8118 1501.9474 1511.0564 1535.7536 2975.2646 2978.2364 2978.6147 2981.2665 2985.3822 2988.7744 3063.4717 3064.9378 3068.1189 3069.5750 3074.1731 3077.7937 3080.6545 3085.5189 3115.2960 3116.7680 3123.1330 3132.3064 3200.2150 3235.7571
redmass: 3.0530 3.9013 2.7712 1.8697 1.8850 1.3975 1.4409 1.9882 1.2747 1.3030 2.3420 1.7764 2.0749 1.6276 1.5883 2.0712 1.9107 2.3358 2.3575 3.0006 3.1294 2.8184 2.7974 4.2705 2.8727 1.8841 7.0401 2.0162 5.6801 3.5254 3.4795 3.0088 1.3440 1.7836 1.7639 1.7199 1.7097 1.1998 1.1863 2.2748 1.3726 1.4234 1.4481 1.4626 1.3583 1.7175 2.7299 2.7016 2.9602 2.7780 2.8435 2.4701 2.3294 1.1954 1.1893 1.1812 1.1848 1.2321 1.2965 4.3034 1.0517 1.0715 1.0508 1.0502 1.0513 1.0532 1.0521 1.0505 1.0537 1.0713 1.0738 1.0579 5.7911 1.0355 1.0356 1.0382 1.0375 1.0391 1.0391 1.0995 1.0995 1.0995 1.0995 1.0984 1.0984 1.1005 1.1004 1.0963 1.0958 1.0961 1.0915 1.0881 1.1013
irintensity: 0.0213 0.1682 0.0593 1.1196 0.2208 0.3739 0.0539 0.5939 0.3350 0.5095 0.1735 0.4037 0.1923 0.1961 0.7083 0.6701 1.0676 1.1955 0.1507 0.5195 0.1092 0.7342 0.9042 6.4708 0.2899 36.8775 0.3025 35.7554 0.4760 8.7377 2.2246 24.8009 1.5929 2.2948 4.2186 2.7303 3.0063 0.0704 0.0030 8.9764 0.3485 2.0053 1.0988 4.1196 1.6691 0.3486 3.4881 6.0917 8.7668 20.8858 41.6961 33.9971 2.3674 11.7606 7.0991 39.2709 8.8627 28.9167 10.2929 10.5099 0.1976 0.0135 3.0633 0.1579 11.4302 2.3816 8.5959 10.5257 11.5827 0.6772 19.2788 23.3007 4.1211 21.1911 16.8911 52.0958 31.1496 41.7590 40.0712 8.6854 6.2500 8.1036 5.9580 84.2971 101.2262 40.1619 37.9644 16.8657 35.0339 31.7787 12.9963 5.7996 2.3147
temp: 298.150 k
press: 1.00000 atm
elementType: 16 6 6 6 6 6 6 6 6 6 6 6 6 1 1 1 1 1 1 1 1 1 1 1 1 1 1 1 1 1 1 1 1
symmnumber: 1
zpe: 752662.0 jmol-1
zpe.correction: 0.286674 hartree
zpe.thermalcorrener: 0.301942 hartree
zpe.thermalcorrenthalpy: 0.302886 hartree
zpe.thermalcorrgfe: 0.246266 hartree
zpe.sumelectzpe: -866.276532 hartree
zpe.sumelectthermal: -866.261264 hartree
zpe.sumelectthermalent: -866.260320 hartree
zpe.sumelectthermalfe: -866.316939 hartree
dipole: 0.7152 -1.0199 0.0376
dipole: 1.2463
quadrupole: -86.2099 -85.8474 -92.1429
quadrupole: 2.7492 0.1709 0.1748
quadrupole: 1.8569 2.2193 -4.0762 2.7492 0.1709 0.1748
hfenergy: -866.5632058 hartree
pointgroup: C01 [X(C12H20S1)]
dipole: -0.1806413 -0.4532651 0.0484494 debye
polarizability: 165.899676|0.8391456|155.0740218|0.501473|-7.1363204|105.3954514 unknown
InChI: InChI=1S/C12H20S/c1-11(2,3)9-7-8-13-10(9)12(4,5)6/h7-8H,1-6H3
charge 0 multiplicity 1
33 atoms
S  1.244205 2.151194 -0.334088
C  -1.721619 -0.827273 0.065264
C  1.831901 -0.605025 0.00407
C  -0.741124 0.372222 -0.131301
C  0.671078 0.417845 -0.093116
C  -3.167651 -0.443668 -0.382848
C  -1.813788 -1.189349 1.580271
C  -1.350783 -2.077375 -0.783108
C  2.03862 -1.292861 -1.38383
C  1.625385 -1.669945 1.121076
C  3.179831 0.102195 0.356118
C  -1.321131 1.695263 -0.331978
C  -0.426923 2.734263 -0.461554
H  -3.813569 -1.337952 -0.309214
H  -3.614411 0.332241 0.264041
H  -3.193537 -0.090357 -1.429801
H  -2.15024 -0.311022 2.161086
H  -2.547484 -2.004493 1.732266
H  -0.847438 -1.513432 1.994037
H  -2.126492 -2.855207 -0.651747
H  -1.307161 -1.816751 -1.856717
H  -0.387661 -2.524304 -0.500573
H  2.87796 -2.012331 -1.326682
H  1.141136 -1.833389 -1.72052
H  2.284327 -0.534682 -2.149405
H  0.765417 -2.330065 0.941494
H  2.526172 -2.309311 1.179005
H  1.489344 -1.181099 2.102687
H  3.973017 -0.662835 0.441537
H  3.493453 0.815478 -0.427016
H  3.116599 0.642841 1.317337
H  -2.395579 1.868641 -0.385119
H  -0.622954 3.793345 -0.61657
