program: Gaussian 09
title: 000005492
version: EM64L-G09RevD.01
frameworkgroup: C1[X(C11H13F3NO)]
method: RPBEPBE
basis: SDD
operation: Freq
keyword: #p
keyword: freq=noraman
keyword: PBEPBE/SDD
title: #p freq=noraman PBEPBE/SDD
converged: YES YES NO NO
title: Mulliken charges:
elementType: F F F O N C C C C C C C C C C C H H H H H H H H H H H H H
charge: -0.152951 -0.152244 -0.100595 -0.136015 -0.235656 0.537731 -0.553830 -0.553595 -0.594720 -0.453095 -0.325886 0.275601 -0.250079 -0.278663 0.059088 0.308398 0.283773 0.266057 0.272851 0.271650 0.266056 0.284537 0.282381 0.271196 0.281874 0.304860 0.254587 0.271530 0.295157
chargesum: 1.00000
title: Mulliken charges with hydrogens summed into heavy atoms:
elementType: F F F O N C C C C C C C C C C C
charge: -0.152951 -0.152244 -0.100595 -0.136015 -0.235656 0.537731 0.268851 0.268647 0.240731 -0.148235 -0.071298 0.275601 0.021451 0.016494 0.059088 0.308398
polarizability: 1.63874531e+02 -5.75486819e+00 1.33369691e+02 -1.01184227e-01 2.03268639e-02 7.72864332e+01
1716.lowfreq: -8.2969 -6.5893 -0.0010 -0.0005 -0.0003 7.9252 26.7072 44.4022 57.5881
frequency: 26.6806 44.2504 57.5810 104.8099 134.2952 145.9801 162.5442 193.2400 224.5973 254.1626 264.2660 281.0365 327.9716 330.3692 353.8846 360.6386 367.3380 406.1367 419.3345 436.8643 459.5936 471.4027 538.8306 568.2322 571.2512 624.0084 668.2678 683.1302 730.7620 736.4548 812.9224 813.2524 910.5705 929.5085 930.5325 949.9447 951.2198 991.2874 991.4524 1007.3548 1045.0528 1069.9676 1091.1819 1104.2390 1112.9273 1121.1766 1146.2036 1209.9247 1212.9237 1219.2269 1249.5019 1267.1720 1319.2202 1391.8098 1419.2493 1422.6180 1442.7115 1452.8580 1455.6398 1462.4933 1463.0093 1477.7305 1483.4180 1486.5108 1501.9574 1580.8629 1609.8271 1629.1644 3030.6448 3031.1670 3035.1421 3144.8226 3146.3575 3151.5440 3152.8751 3157.1736 3162.6376 3165.6690 3169.7303 3174.8704 3191.3931
redmass: 8.2979 3.9049 7.7309 6.6859 2.9191 5.9048 7.3198 1.0663 9.5213 3.1430 1.1573 5.7902 2.8586 1.0654 3.8672 3.9413 6.2215 2.5364 4.7372 11.8162 6.3209 3.4570 3.0993 8.8083 5.1770 11.7250 7.5722 2.3573 7.0247 4.2130 3.4014 1.6867 2.5810 1.5760 2.8516 5.5179 1.5160 5.6007 4.1533 1.6521 1.1915 9.4927 1.5660 1.3030 1.8428 1.6652 4.2322 1.1077 1.8464 1.8088 2.1384 3.9181 1.3093 7.7411 1.1417 1.1351 2.7773 1.0478 1.1853 1.2728 1.0452 1.1227 1.4583 1.0465 1.0617 6.2694 7.4906 9.5217 1.0320 1.0320 1.0331 1.1055 1.1057 1.0925 1.1041 1.1056 1.1059 1.1039 1.0916 1.0931 1.0985
irintensity: 0.4764 0.0070 0.8301 0.2957 1.0830 1.8643 10.9806 0.0094 2.3761 0.7468 0.2363 2.3045 1.3460 0.2739 2.9193 1.7451 1.0551 0.1339 0.0440 3.7450 7.3799 2.3106 0.1126 10.6216 8.7789 33.1757 2.1258 21.9600 5.9334 32.3831 78.5847 13.8097 8.6969 17.1795 23.5720 46.5186 7.6458 40.5868 160.8612 44.2947 0.1128 157.7799 0.1573 0.4761 26.1841 0.8095 258.6905 1.5563 0.1234 1.2208 9.4078 21.9451 2.3860 1.2562 18.5090 18.0107 29.9100 0.0772 9.1560 10.7484 2.7207 41.4195 28.9106 36.9620 76.3098 32.6364 41.8272 66.4147 1.6837 2.1080 2.2387 0.2514 0.2560 9.8828 6.9188 0.5911 0.8480 2.8513 6.8824 1.4371 2.7756
temp: 298.150 k
press: 1.00000 atm
elementType: 9 9 9 8 7 6 6 6 6 6 6 6 6 6 6 6 1 1 1 1 1 1 1 1 1 1 1 1 1
symmnumber: 1
zpe: 588554.1 jmol-1
zpe.correction: 0.224168 hartree
zpe.thermalcorrener: 0.239883 hartree
zpe.thermalcorrenthalpy: 0.240827 hartree
zpe.thermalcorrgfe: 0.180688 hartree
zpe.sumelectzpe: -854.991712 hartree
zpe.sumelectthermal: -854.975998 hartree
zpe.sumelectthermalent: -854.975054 hartree
zpe.sumelectthermalfe: -855.035192 hartree
dipole: -16.1469 1.2289 0.0078
dipole: 16.1936
quadrupole: -38.4447 -78.3631 -87.5301
quadrupole: 8.7691 -0.0401 -0.0710
quadrupole: 29.6679 -10.2504 -19.4175 8.7691 -0.0401 -0.0710
hfenergy: -855.2158807 hartree
pointgroup: C01 [X(C11H13F3N1O1)]
dipole: -6.3634251 -0.3069511 0.0552828 debye
polarizability: 164.1671762|4.9517392|132.509981|-0.6175672|5.5254537|77.8534978 unknown
InChI: InChI=1S/C11H13F3NO/c1-15(2,3)9-6-4-5-8(7-9)10(16)11(12,13)14/h4-7H,1-3H3
charge 1 multiplicity 1
29 atoms
F  3.419951 -0.862224 1.012157
F  3.38164 -0.613532 -1.254574
F  4.286221 1.004877 0.054425
O  1.77811 2.005306 0.203165
N  -3.163059 0.501044 0.104171
C  -1.799372 -0.189067 0.01676
C  -3.924422 -0.021811 1.333881
C  -3.97071 0.206756 -1.171205
C  -3.046188 2.021267 0.240816
C  -0.613952 0.552836 0.075742
C  -1.768396 -1.599458 -0.12312
C  0.638494 -0.116717 -0.006371
C  -0.52463 -2.256353 -0.20488
C  0.6827 -1.525435 -0.147967
C  1.850231 0.763873 0.068017
C  3.255962 0.088079 -0.028557
H  -3.333741 0.203349 2.233996
H  -4.903536 0.479101 1.381004
H  -4.06517 -1.10747 1.245421
H  -4.132827 -0.875674 -1.263672
H  -4.940253 0.723741 -1.101518
H  -3.402135 0.572246 -2.038883
H  -2.533436 2.434061 -0.639798
H  -4.064265 2.434314 0.300688
H  -2.495667 2.269625 1.159495
H  -0.579477 1.640579 0.183227
H  -2.682837 -2.19992 -0.169965
H  -0.499065 -3.344257 -0.313098
H  1.635331 -2.056934 -0.21276
