program: Gaussian 09
title: 000034774
version: EM64L-G09RevD.01
frameworkgroup: C1[X(C10H20O2)]
method: RPBEPBE
basis: SDD
operation: Freq
keyword: #pfreq=noraman
keyword: PBEPBE/SDD
title: #p freq=noraman PBEPBE/SDD
converged: YES YES NO NO
title: Mulliken charges:
elementType: O O C C C C C C C C C C H H H H H H H H H H H H H H H H H H H H
charge: -0.316492 -0.446521 0.371485 0.434998 -0.191918 -0.632929 -0.397363 -0.424534 -0.767509 -0.770924 -0.731042 -0.713820 0.222784 0.236122 0.230652 0.206425 0.241865 0.219944 0.206435 0.237375 0.217708 0.215688 0.225699 0.256877 0.199541 0.336780 0.208306 0.245214 0.216065 0.223494 0.220336 0.219261
chargesum: 0.00000
title: Mulliken charges with hydrogens summed into heavy atoms:
elementType: O O C C C C C C C C C C
charge: -0.316492 -0.109741 0.371485 0.434998 0.030866 -0.166155 0.050927 0.001844 -0.096738 -0.088807 -0.061457 -0.050730
polarizability: 1.33706340e+02 2.60983748e+00 1.06940339e+02 5.13309559e-01 -1.08202192e+00 9.95776886e+01
1716.lowfreq: -13.9023 -5.7294 -0.0005 0.0002 0.0005 19.6982 38.9953 84.1863 100.2607
frequency: 38.2434 84.1415 100.2262 139.2796 148.2210 196.5447 202.9428 228.8190 251.9249 260.1522 269.6929 278.8211 284.6616 320.9398 327.1369 360.7013 368.3889 404.1181 444.9145 466.3471 530.4682 589.3978 634.0448 737.0834 774.4415 779.6864 802.3463 820.6754 851.8412 897.9961 914.4651 921.7657 937.4657 985.5011 1003.8616 1015.6153 1021.0902 1034.9350 1050.5350 1059.5928 1095.6413 1101.9573 1126.7699 1189.8231 1191.3866 1205.8541 1229.3051 1233.1597 1275.6784 1293.8074 1303.8626 1317.5186 1323.1900 1329.3805 1370.3675 1379.1941 1380.0497 1386.2005 1387.4721 1455.4645 1456.6601 1463.1186 1467.1089 1470.8687 1475.1775 1479.6549 1486.2960 1486.5857 1488.0249 1489.9218 2975.3839 2977.0560 2981.5907 2982.4374 2985.1561 2985.7816 3002.4338 3005.2021 3037.5727 3061.1516 3063.0299 3069.3916 3075.7708 3076.4750 3079.0283 3080.8152 3091.1837 3093.1870 3101.4674 3565.5880
redmass: 3.5769 2.3091 2.1463 3.0899 2.0041 1.0377 1.6895 1.2367 1.3957 1.7299 1.5128 2.0907 1.6863 2.3710 2.8262 2.6144 2.2858 3.1965 2.0355 3.7278 3.0166 3.1654 3.2851 5.4200 1.2648 1.1839 4.5137 2.3734 2.3718 1.7150 1.8799 1.9188 2.1440 1.9836 1.7162 1.5816 1.9274 1.8010 2.1118 1.9588 1.8305 1.9729 1.4541 1.8952 1.7720 1.7364 2.0178 1.9243 1.5273 1.4668 1.5779 1.4421 1.5842 1.5390 1.4765 1.2405 1.2273 1.2201 1.2032 1.0752 1.0663 1.0662 1.0623 1.0654 1.0601 1.0487 1.0555 1.0660 1.0502 1.0521 1.0806 1.0359 1.0356 1.0385 1.0446 1.0505 1.0646 1.0642 1.1006 1.1026 1.0980 1.0991 1.0980 1.0984 1.0985 1.0991 1.1002 1.0997 1.0998 1.0661
irintensity: 0.7511 0.1513 0.0554 1.0637 0.0627 0.2647 3.3878 3.6249 8.4608 37.8776 6.7189 29.5379 64.1422 6.2599 5.1716 0.7854 0.5595 0.4970 0.4466 10.5637 6.6735 0.4085 4.5296 6.2505 4.1315 11.4478 40.5103 10.0392 13.9548 5.3533 17.7298 18.1954 14.9228 42.3757 20.1792 25.0891 1.4038 27.7268 19.8668 8.6067 43.8519 16.0812 63.9594 12.9903 3.6068 3.8728 5.4197 4.3826 18.6259 13.4600 6.5558 4.4012 15.7220 0.1628 11.1506 6.3055 28.1453 22.4417 17.3239 10.7376 4.3947 2.7410 12.9659 13.2972 5.0775 11.9064 6.2625 6.7423 18.6114 3.6532 22.9458 32.0903 38.0051 39.3317 25.4425 25.2245 24.7503 32.5234 5.9195 20.9864 13.9595 51.6424 22.1690 80.5604 26.9556 39.1878 26.3253 48.7676 15.7077 4.6261
temp: 298.150 k
press: 1.00000 atm
elementType: 8 8 6 6 6 6 6 6 6 6 6 6 1 1 1 1 1 1 1 1 1 1 1 1 1 1 1 1 1 1 1 1
symmnumber: 1
zpe: 742690.9 jmol-1
zpe.correction: 0.282876 hartree
zpe.thermalcorrener: 0.297367 hartree
zpe.thermalcorrenthalpy: 0.298311 hartree
zpe.thermalcorrgfe: 0.243052 hartree
zpe.sumelectzpe: -542.503136 hartree
zpe.sumelectthermal: -542.488645 hartree
zpe.sumelectthermalent: -542.487701 hartree
zpe.sumelectthermalfe: -542.542960 hartree
dipole: 0.9696 0.6127 2.8529
dipole: 3.0749
quadrupole: -75.5159 -73.8201 -74.7180
quadrupole: 2.1589 -0.3573 2.0949
quadrupole: -0.8313 0.8645 -0.0333 2.1589 -0.3573 2.0949
hfenergy: -542.7860123 hartree
pointgroup: C01 [X(C10H20O2)]
dipole: -0.3819984 0.3313519 -1.0989857 debye
polarizability: 133.7016049|-2.6678269|106.7231071|0.2760224|1.6627616|99.7996557 unknown
InChI: InChI=1S/C10H20O2/c1-5-9(3)7-8(11)10(4,6-2)12-9/h8,11H,5-7H2,1-4H3
charge 0 multiplicity 1
32 atoms
O  -0.128596 -0.630859 0.849275
O  1.165299 1.927715 -0.431982
C  1.079046 -0.50688 -0.033354
C  -1.303634 0.106251 0.266384
C  0.727511 0.645662 -1.018331
C  -0.812237 0.559377 -1.139357
C  2.272833 -0.218801 0.903961
C  -2.467162 -0.913268 0.204049
C  1.244534 -1.839153 -0.801166
C  -1.606867 1.292588 1.204194
C  3.635109 -0.067944 0.192484
C  -3.782968 -0.35706 -0.385367
H  1.226729 0.50101 -1.998279
H  -1.258062 1.520953 -1.451229
H  -1.080451 -0.19839 -1.899195
H  2.31505 -1.042945 1.642238
H  2.042785 0.706476 1.458237
H  -2.646041 -1.290232 1.229354
H  -2.12458 -1.781263 -0.392763
H  1.329236 -2.666055 -0.075064
H  0.371189 -2.045063 -1.445766
H  2.14946 -1.835618 -1.435597
H  -1.837305 0.917211 2.216975
H  -0.724001 1.950338 1.266528
H  -2.469112 1.886187 0.846631
H  0.836075 2.662439 -1.008447
H  3.947292 -0.996481 -0.320083
H  3.599007 0.750445 -0.548358
H  4.421384 0.183057 0.927766
H  -4.207548 0.443849 0.24608
H  -3.631817 0.055159 -1.401012
H  -4.541657 -1.157204 -0.461807
