program: Gaussian 09
title: 000034776
version: EM64L-G09RevD.01
frameworkgroup: C1[X(C12H17NO)]
method: RPBEPBE
basis: SDD
operation: Freq
keyword: #p
keyword: freq=noraman
keyword: PBEPBE/SDD
title: #p freq=noraman PBEPBE/SDD
converged: YES YES NO NO
title: Mulliken charges:
elementType: O N C C C C C C C C C C C C H H H H H H H H H H H H H H H H H
charge: -0.475636 -0.361575 -0.279785 -0.503644 -0.502031 0.477849 -0.435440 -0.421181 0.450236 -0.430991 -0.399822 -0.191322 -0.433177 -0.615453 0.251572 0.232828 0.230758 0.232194 0.233536 0.237967 0.237591 0.224984 0.278537 0.199825 0.239525 0.217713 0.275611 0.360517 0.205377 0.227705 0.235730
chargesum: 0.00000
title: Mulliken charges with hydrogens summed into heavy atoms:
elementType: O N C C C C C C C C C C C C
charge: -0.115119 -0.085965 -0.028213 -0.040058 -0.036300 0.477849 -0.197473 -0.183590 0.450236 -0.206007 -0.121285 0.008503 0.024061 0.053359
polarizability: 1.93709432e+02 -2.83180535e+00 1.14169140e+02 4.49877919e+00 1.63919137e+01 1.09502492e+02
1716.lowfreq: -4.3863 -0.0008 -0.0004 0.0005 4.1106 13.0036 20.6660 34.7809 44.0202
frequency: 20.4807 34.5719 43.9904 74.6635 108.0203 120.2817 155.3831 203.4593 221.8423 232.6352 264.7987 349.4582 366.0297 407.2111 409.3215 443.5494 511.3252 538.1647 584.6205 634.4104 649.1041 696.5916 745.8435 780.5009 798.7535 811.4660 819.0457 844.2270 867.3361 880.7483 889.7687 914.1764 953.9930 962.3305 991.2781 1008.8196 1013.3114 1040.7329 1050.6348 1056.1361 1065.6029 1098.9337 1101.7613 1115.8886 1125.9834 1151.2934 1169.9032 1170.9276 1181.2057 1207.0599 1235.2896 1235.6887 1258.9717 1292.3289 1308.7982 1328.0846 1364.9810 1372.0646 1395.9562 1403.6431 1435.7710 1443.3229 1444.1766 1464.3301 1470.6149 1471.7807 1493.1700 1511.9017 1577.7880 1624.5248 2895.6217 2915.9360 2935.4118 3033.4450 3045.7163 3082.3323 3086.4395 3093.0965 3103.8868 3104.9377 3125.1925 3136.4719 3165.8455 3191.1536 3209.2876 3263.6562 3438.8779
redmass: 2.6732 3.8001 3.9383 2.5411 2.9262 3.1562 2.4019 2.0585 2.5091 4.0251 2.6427 2.9955 3.7973 3.2214 3.7982 3.0124 3.8462 2.9711 2.3705 6.6789 1.2131 3.6110 2.6772 1.2690 1.1433 2.7497 1.2844 1.4700 1.3503 2.6256 4.1128 3.9927 1.7828 1.5607 1.3952 2.0298 2.8123 3.6264 1.2108 1.6107 1.2128 1.2095 1.3049 1.4301 1.8042 2.6598 1.4022 2.3497 1.2600 2.3583 1.4275 1.4150 1.1839 1.2005 1.3043 1.2541 2.1408 3.7848 1.9154 2.6571 1.1426 1.0872 1.2124 1.0911 1.2983 1.0600 1.0424 2.9996 7.1527 6.4548 1.0826 1.0509 1.0667 1.0814 1.0946 1.0849 1.1010 1.0509 1.0650 1.0875 1.0895 1.0954 1.0943 1.1173 1.1153 1.0635 1.0743
irintensity: 0.9631 1.5287 0.3481 3.7268 0.1586 0.9441 1.3481 0.9532 0.6280 3.7693 4.9393 12.2545 1.6843 0.6559 0.4739 0.1691 5.3194 1.9866 29.6856 0.4433 39.4753 10.9052 4.5931 139.5251 12.2388 1.3274 13.7743 47.9492 24.6642 17.5842 18.6577 4.8505 1.9193 0.5848 2.2266 10.6710 11.4332 50.9501 32.5013 3.1843 7.7470 6.0499 13.3375 9.5640 42.8370 31.6018 1.2482 2.8795 3.0648 22.2588 7.8772 17.9240 11.2438 7.1745 15.0110 4.9643 21.0399 18.7102 56.3907 4.4346 1.4988 8.4144 11.5063 17.9896 8.3350 14.9931 15.3794 27.8470 0.9475 0.9979 61.8703 118.8970 66.7651 41.4754 16.9427 12.9700 34.1272 20.6342 12.4378 19.4192 17.6552 19.0924 3.1558 0.4250 42.2808 162.7289 0.0052
temp: 298.150 k
press: 1.00000 atm
elementType: 8 7 6 6 6 6 6 6 6 6 6 6 6 6 1 1 1 1 1 1 1 1 1 1 1 1 1 1 1 1 1
symmnumber: 1
zpe: 692925.3 jmol-1
zpe.correction: 0.263921 hartree
zpe.thermalcorrener: 0.278174 hartree
zpe.thermalcorrenthalpy: 0.279118 hartree
zpe.thermalcorrgfe: 0.220731 hartree
zpe.sumelectzpe: -596.336139 hartree
zpe.sumelectthermal: -596.321887 hartree
zpe.sumelectthermalent: -596.320942 hartree
zpe.sumelectthermalfe: -596.379329 hartree
dipole: -1.7085 -3.1581 0.2990
dipole: 3.6031
quadrupole: -65.5542 -88.7963 -82.5839
quadrupole: 9.4731 -0.7262 4.7092
quadrupole: 13.4239 -9.8182 -3.6058 9.4731 -0.7262 4.7092
hfenergy: -596.6000602 hartree
pointgroup: C01 [X(C12H17N1O1)]
dipole: 0.6555585 0.560792 -1.124817 debye
polarizability: 193.7542313|-4.7892994|99.0332281|0.0630023|10.6044039|124.5936043 unknown
InChI: InChI=1S/C12H17NO/c1-13-8-12(14)11-6-4-10(5-7-11)9-2-3-9/h4-7,9,12-14H,2-3,8H2,1H3
charge 0 multiplicity 1
31 atoms
O  2.695079 -0.803485 1.438172
N  4.300641 0.336136 -0.402675
C  -3.692053 -0.058985 0.152131
C  -4.431944 0.724142 -0.943814
C  -4.345473 1.291995 0.484116
C  -2.193221 -0.213978 0.125106
C  -1.537502 -0.748697 -1.013412
C  -1.407417 0.115599 1.259407
C  0.639657 -0.604932 0.11706
C  -0.139441 -0.944974 -1.016677
C  -0.008841 -0.075153 1.25824
C  2.151123 -0.767063 0.083877
C  2.841937 0.415167 -0.665361
C  5.055612 1.59752 -0.567738
H  -4.225003 -0.939666 0.535553
H  -5.397301 0.34584 -1.293051
H  -3.826905 1.209987 -1.715698
H  -3.682475 2.147468 0.646106
H  -5.252168 1.295609 1.096281
H  -2.13263 -1.014834 -1.895274
H  -1.903739 0.522366 2.149025
H  0.345833 -1.375968 -1.902479
H  0.598818 0.156822 2.138014
H  2.403701 -1.714073 -0.449619
H  2.474651 1.364832 -0.23412
H  2.570828 0.404366 -1.74443
H  4.736657 -0.441705 -0.917698
H  3.633128 -0.453099 1.316485
H  4.994541 2.031869 -1.591628
H  6.119576 1.425295 -0.328059
H  4.667332 2.349399 0.14196
