program: Gaussian 09
title: 000005487
version: EM64L-G09RevD.01
frameworkgroup: C1[X(C9H8ClN5S)]
method: RPBEPBE
basis: SDD
operation: Freq
keyword: #p
keyword: freq=noraman
keyword: PBEPBE/SDD
title: #p freq=noraman PBEPBE/SDD
converged: YES YES NO NO
title: Mulliken charges:
elementType: Cl S N N N N N C C C C C C C C C H H H H H H H H
charge: -0.050563 0.518274 -0.420584 -0.449009 -0.082731 -0.412404 -0.402096 -0.388746 -0.466798 0.229205 0.638829 0.067803 0.119894 -0.410427 -0.335016 -0.209241 0.225660 0.230454 0.230792 0.229265 0.296242 0.318316 0.265311 0.257571
chargesum: 0.00000
title: Mulliken charges with hydrogens summed into heavy atoms:
elementType: Cl S N N N N N C C C C C C C C C
charge: -0.050563 0.518274 -0.124342 -0.130693 -0.082731 -0.412404 -0.402096 0.067368 -0.006741 0.229205 0.638829 0.067803 0.119894 -0.410427 -0.069705 0.048330
polarizability: 2.03755663e+02 5.97928177e+00 1.99881164e+02 1.38619613e+01 -2.52287658e+00 8.85342329e+01
1716.lowfreq: -7.4012 -3.8411 0.0017 0.0023 0.0031 4.1315 36.9514 50.4281 63.8796
frequency: 36.9192 50.4205 63.8691 84.4303 116.5230 164.8557 186.1607 202.0590 238.5930 295.3410 308.6858 326.7525 361.0016 413.5426 435.7460 453.9792 515.9263 548.3540 554.0020 562.7024 603.8319 625.3516 644.5804 655.4102 717.2245 734.5005 739.2830 758.7802 786.3521 795.6432 823.5556 891.4715 897.6031 940.4919 949.2085 1013.6897 1045.9617 1080.0148 1084.1886 1116.0603 1178.8684 1204.6162 1211.7052 1252.2422 1279.5292 1280.9935 1303.3665 1312.4558 1354.6727 1391.7247 1432.6720 1462.6158 1471.1065 1487.6891 1505.9652 1542.6755 1599.3272 1621.1673 2989.4959 3006.6053 3037.5650 3065.9350 3165.6181 3197.0395 3493.9879 3551.1744
redmass: 4.4871 5.1694 4.3200 9.0306 2.3790 7.3487 10.4753 6.3365 5.9721 7.7263 6.7451 7.6629 4.1623 1.6159 4.4323 5.5997 9.3000 5.3012 1.6818 5.1474 9.5785 4.9798 6.5928 6.3036 13.4530 4.5424 4.5526 6.6242 4.9010 1.7874 1.2856 5.2696 6.0181 4.1245 1.2987 3.1064 5.8175 2.2127 2.4803 1.8029 1.1823 2.0738 1.1107 1.6858 1.5665 3.5287 1.6000 2.2021 3.1858 2.0141 4.0188 4.7412 1.0978 1.8785 1.3545 8.2126 6.0656 6.6859 1.0581 1.0615 1.1072 1.1062 1.0891 1.0973 1.0747 1.0786
irintensity: 2.3450 1.2088 0.4529 0.0486 3.0637 1.6518 1.7488 5.9520 5.7011 5.4877 0.4750 14.4733 37.1189 128.6700 38.7636 17.6190 1.7445 9.9412 96.2040 5.6138 9.1466 34.8319 13.5685 18.6360 20.4331 2.1648 6.4188 3.4027 7.7505 43.9223 0.2641 24.9849 49.1996 24.8924 0.1015 13.6359 47.6487 1.1668 1.0965 7.1307 7.0769 23.9935 0.9492 39.6408 60.5511 16.5838 3.9859 52.0176 10.9301 24.0781 135.5047 19.9220 2.4826 139.1361 93.7474 242.1270 165.7203 156.9593 51.8994 92.2192 5.3486 56.8024 2.0202 1.7671 41.6578 16.3026
temp: 298.150 k
press: 1.00000 atm
elementType: 17 16 7 7 7 7 7 6 6 6 6 6 6 6 6 6 1 1 1 1 1 1 1 1
symmnumber: 1
zpe: 437976.1 jmol-1
zpe.correction: 0.166816 hartree
zpe.thermalcorrener: 0.180769 hartree
zpe.thermalcorrenthalpy: 0.181713 hartree
zpe.thermalcorrgfe: 0.124480 hartree
zpe.sumelectzpe: -1478.442155 hartree
zpe.sumelectthermal: -1478.428202 hartree
zpe.sumelectthermalent: -1478.427258 hartree
zpe.sumelectthermalfe: -1478.484491 hartree
dipole: -2.0653 0.9850 -2.2947
dipole: 3.2405
quadrupole: -90.4309 -107.4528 -107.5693
quadrupole: 6.1808 5.1614 -0.9825
quadrupole: 11.3868 -5.6351 -5.7516 6.1808 5.1614 -0.9825
hfenergy: -1478.6089711 hartree
pointgroup: C01 [X(C9H8Cl1N5S1)]
dipole: 0.8284339 -0.414145 -0.876128 debye
dipolederiv: -0.1175755 0.1767045 -0.0029908 -0.0198009 -0.8003094 0.0508559 0.0219654 0.0161094 -0.0534551 0.2115517 -0.1126729 0.0142708 0.0204797 -0.1887038 0.0800853 -0.0106397 0.0814278 0.2333321 -1.0755615 0.163384 0.372412 0.0540133 -0.5710792 -0.223274 0.1100939 -0.1622993 -0.4518628 -1.8646202 -0.0360368 0.0328551 -0.2089854 -0.2475881 -0.0318832 0.2121335 -0.0726199 -0.5031993 -0.6974844 -0.0113172 0.0356949 -0.2000964 -0.4369521 -0.1815562 -0.1708331 -0.2202168 -0.7154904 -0.2457144 -0.2782582 0.0607407 -0.0307476 0.1358037 -0.0545523 0.0320291 0.0569381 -0.2423672 -0.1364137 0.3959896 -0.1121854 0.0504495 -0.0337943 -0.0464907 -0.0273475 -0.1440132 -0.2519463 0.4000336 0.0192725 0.0748579 0.1278174 0.2612196 -0.1208267 0.2968952 -0.0851139 0.0420977 0.3726022 0.067516 0.1196524 -0.0144961 0.2695676 0.0318048 0.0785436 0.0039998 0.2314254 1.877513 0.0298817 -0.3130199 0.809615 0.3896093 0.3830781 -0.2794882 0.3802114 0.9582511 1.5308993 -0.0855389 -0.1057467 -0.391093 -0.0975891 -0.0181033 -0.3615164 -0.0538499 0.1639598 -0.1463265 -0.2972378 0.0694638 0.3661806 0.0613484 -0.0531516 0.1115588 0.0695634 0.0356667 -0.1247914 0.3297763 0.0122273 -0.041756 -0.0133292 0.0265046 0.05923 -0.0401143 0.1151815 -0.5232394 -0.2841974 0.0310638 -0.3551766 1.0974365 -0.0229058 -0.025467 -0.008163 -0.1388393 -0.0213937 0.0509228 -0.0771575 0.2049406 -0.0928077 -0.0241023 -0.0580016 -0.02042 -0.1620824 0.4172459 -0.0052711 -0.0591617 -0.0857871 -0.2056816 0.0209758 -0.1022907 0.0079912 -0.0471032 -0.0114492 -0.0421621 0.0308323 -0.1329036 -0.0418777 0.1240383 0.0734702 0.1166943 -0.0257442 -0.1980572 0.0670032 -0.025297 0.1201632 0.00522 0.0274373 -0.0835718 0.0221311 0.0715967 -0.0538834 -0.0205935 -0.1257508 0.0550539 0.075995 0.0452992 -0.1077891 0.0195298 -0.0900241 -0.0005713 0.000978 -0.030968 -0.0697241 -0.1688652 -0.062134 0.0610951 0.020649 0.0803926 0.2121769 -0.07524 -0.0534294 -0.1549958 0.3310134 0.0702227 -0.0347261 -0.0360559 0.0928799 0.1371277 0.002229 -0.0185362 -0.0665593 0.184962 -0.0494129 0.1282523 0.026613 0.3365817 0.0031461 -0.0039616 0.0456548 0.0513498 0.0635963 -0.0010076 0.0334899 0.0051551 0.1724974 0.0547854 -0.0511704 0.0245175 -0.0879412 0.0228054 0.0290985 0.0429143 0.0158529 0.1482517 unknown
polarizability: 203.3120049|5.1806429|200.1293566|-14.1775159|-5.4557126|88.7296985 unknown
InChI: InChI=1S/C9H8ClN5S/c10-5-1-2-6-8(15-16-14-6)7(5)13-9-11-3-4-12-9/h1-2,11,13H,3-4H2
charge 0 multiplicity 1
24 atoms
Cl -1.028297 -3.528173 0.09343
S  -1.044028 3.058648 -0.598527
N  3.168249 -0.626967 -0.885095
N  0.867875 -1.215544 -0.510636
N  2.11438 0.184353 1.022501
N  -0.048404 1.583685 -0.668299
N  -2.551147 2.263837 -0.084329
C  4.227897 0.218374 -0.27098
C  3.489673 0.780602 1.011028
C  2.015495 -0.509566 -0.085483
C  -0.441888 -0.826883 -0.217048
C  -0.863721 0.562878 -0.29045
C  -2.261388 0.933942 0.017195
C  -1.458276 -1.749572 0.060129
C  -3.233553 -0.072599 0.340111
C  -2.821003 -1.399761 0.334086
H  4.540988 1.026965 -0.957651
H  5.116234 -0.383972 -0.01042
H  4.014704 0.489282 1.937554
H  3.412798 1.883447 0.999274
H  3.084263 -0.706429 -1.899972
H  1.00356 -2.207986 -0.727936
H  -4.262708 0.214376 0.563372
H  -3.529603 -2.202837 0.556548
