program: Gaussian 09
title: 000034789
version: EM64L-G09RevD.01
frameworkgroup: C1[X(C13H18ClNO)]
method: RPBEPBE
basis: SDD
operation: Freq
keyword: #p
keyword: freq=noraman
keyword: PBEPBE/SDD
title: #p freq=noraman PBEPBE/SDD
converged: YES YES NO NO
title: Mulliken charges:
elementType: Cl O N C C C C C C C C C C C C C H H H H H H H H H H H H H H H H H H
charge: -0.053439 -0.293014 -0.076457 -0.196896 -0.464764 -0.420767 0.482984 -0.551947 0.153749 -0.348904 0.139279 -0.638637 -0.633473 -0.237057 -0.376861 -0.518866 0.241370 0.225214 0.204574 0.215334 0.206497 0.260098 0.209742 0.242398 0.179557 0.224820 0.219935 0.192955 0.228829 0.254572 0.253742 0.220193 0.234677 0.220561
chargesum: 0.00000
title: Mulliken charges with hydrogens summed into heavy atoms:
elementType: Cl O N C C C C C C C C C C C C C
charge: -0.053439 -0.293014 -0.076457 0.044474 -0.034976 0.001064 0.482984 -0.082107 0.153749 -0.348904 0.139279 0.008139 0.008246 0.017515 -0.123119 0.156565
polarizability: 1.94285246e+02 -4.53224976e+00 1.65537563e+02 6.29863898e+00 3.40599913e+00 1.09538695e+02
1716.lowfreq: -11.2833 -8.2001 -3.9458 0.0014 0.0025 0.0029 39.6043 55.5245 72.6401
frequency: 39.4604 55.5016 72.6196 79.7764 89.9115 126.7151 141.9055 166.5792 202.5529 218.8187 225.5372 245.6536 266.6267 293.9296 304.6405 323.2239 348.8740 367.4870 404.4868 426.3225 452.2498 485.6577 514.6641 543.7097 564.0253 606.5479 638.7839 678.5732 763.2862 790.3895 815.9806 821.9478 860.2269 884.3423 897.8933 930.9415 943.3577 972.5617 1018.1127 1036.8119 1048.3936 1072.8584 1090.8499 1094.9715 1109.5408 1122.4956 1134.6677 1140.3906 1150.5773 1170.1600 1174.1130 1194.7155 1207.3952 1227.6237 1258.3235 1263.8442 1312.5115 1319.6683 1326.0317 1341.9270 1351.8033 1367.3569 1410.9880 1419.8617 1421.3778 1440.2318 1444.7698 1456.4944 1458.3439 1463.8734 1468.5050 1470.3932 1470.8130 1477.1597 1484.9591 1494.3887 1571.9753 1588.8280 2839.0874 2858.8105 2950.9287 2956.3154 2976.8400 2978.8536 2984.4478 3006.3520 3011.9162 3038.1970 3041.2191 3043.0513 3049.9502 3066.5667 3073.8223 3113.2195 3154.5986 3175.8856
redmass: 3.5325 2.6740 2.6211 3.1259 5.4918 3.0859 1.1182 3.7021 2.9906 2.3070 1.3048 1.2786 3.4693 3.2888 2.8782 3.1317 6.1807 3.2919 4.4080 3.0630 3.8391 3.1353 3.6451 4.1711 3.3692 4.0303 4.8155 3.4431 5.0150 3.5770 3.1183 1.4906 3.9675 1.5354 2.6466 3.0318 1.3706 4.1841 2.3556 2.4419 1.5863 1.9623 1.3459 2.0703 1.2485 1.7699 1.3815 1.3111 1.4005 1.7790 1.7334 2.2704 1.8725 3.8443 1.3964 2.0888 1.3583 1.5977 1.3868 1.6517 1.4946 3.4411 4.6055 1.3117 1.3747 1.1596 1.6455 1.0638 1.0540 1.0825 1.0816 1.0858 1.0670 1.0687 1.0644 1.0540 7.0693 8.7588 1.0580 1.0574 1.0645 1.0343 1.0832 1.0615 1.0616 1.0720 1.0702 1.0987 1.1023 1.0950 1.1026 1.1006 1.0998 1.1004 1.0884 1.0976
irintensity: 0.1082 3.1677 0.5656 2.0431 1.0326 0.5249 0.0843 1.7689 3.6887 3.1398 0.6844 1.7776 3.2567 3.1908 2.3175 5.8957 2.0865 6.8530 0.4335 0.6542 0.8943 3.6902 9.9641 4.6961 5.3622 5.9038 15.5725 5.7455 2.5170 7.2361 22.8525 37.9505 19.3723 4.5214 21.5856 16.7723 1.2583 24.5685 33.9614 32.2780 26.2788 32.2073 8.2162 8.2195 0.3176 8.6030 4.4362 0.5860 1.9387 13.4149 39.0940 14.5318 10.0409 58.9985 2.7317 4.8810 5.4112 18.0565 4.5254 0.4419 12.1692 3.2046 0.0130 36.3785 20.6854 12.0445 57.8295 13.0663 11.1406 1.5306 2.5967 13.6962 16.3030 16.3520 2.9837 8.8437 3.7508 1.3706 79.3662 181.8542 9.0401 86.9853 11.2296 34.4237 44.8090 44.8157 39.2394 47.4415 35.9930 38.1142 43.2258 29.6760 37.3576 32.2997 2.9478 5.8979
temp: 298.150 k
press: 1.00000 atm
elementType: 17 8 7 6 6 6 6 6 6 6 6 6 6 6 6 6 1 1 1 1 1 1 1 1 1 1 1 1 1 1 1 1 1 1
symmnumber: 1
zpe: 741469.0 jmol-1
zpe.correction: 0.282411 hartree
zpe.thermalcorrener: 0.298968 hartree
zpe.thermalcorrenthalpy: 0.299912 hartree
zpe.thermalcorrgfe: 0.238239 hartree
zpe.sumelectzpe: -1094.959672 hartree
zpe.sumelectthermal: -1094.943115 hartree
zpe.sumelectthermalent: -1094.942171 hartree
zpe.sumelectthermalfe: -1095.003844 hartree
dipole: 0.8012 -2.5785 1.4694
dipole: 3.0740
quadrupole: -100.6527 -99.5736 -101.9478
quadrupole: 3.1420 7.1040 0.2288
quadrupole: 0.0720 1.1511 -1.2231 3.1420 7.1040 0.2288
hfenergy: -1095.2420828 hartree
pointgroup: C01 [X(C13H18Cl1N1O1)]
dipole: -0.133899 0.885975 0.812294 debye
polarizability: 191.6560035|-6.3719604|165.4463589|-11.2342956|11.2146879|112.2591417 unknown
InChI: InChI=1S/C13H18ClNO/c1-15(2)11-6-4-5-9-12(16-3)8-7-10(14)13(9)11/h7-8,11H,4-6H2,1-3H3
charge 0 multiplicity 1
34 atoms
Cl 1.663685 -2.621976 -1.152276
O  -3.363226 0.455829 0.117634
N  2.493112 -0.068021 0.660409
C  1.660566 0.441311 -0.470273
C  1.586528 2.006699 -0.535959
C  0.222198 2.543057 -1.01171
C  0.2923 -0.253211 -0.442068
C  -0.890716 1.983099 -0.100534
C  -0.911862 0.46343 -0.175536
C  0.186866 -1.645786 -0.682592
C  -2.143271 -0.243477 -0.096234
C  2.01317 0.240218 2.014191
C  3.937902 0.130082 0.478804
C  -1.032046 -2.345269 -0.623334
C  -2.209713 -1.634266 -0.311344
C  -3.620175 0.825251 1.520685
H  2.175319 0.080467 -1.383665
H  2.398955 2.382651 -1.18477
H  1.776906 2.414664 0.476928
H  0.026704 2.238536 -2.058611
H  0.220378 3.649732 -0.985579
H  -1.885251 2.365006 -0.393603
H  -0.705878 2.329739 0.938805
H  0.94416 -0.022317 2.101565
H  2.134042 1.311097 2.321237
H  2.571808 -0.375186 2.743438
H  4.485458 -0.43792 1.253674
H  4.270566 1.196853 0.54641
H  4.242986 -0.263599 -0.508057
H  -1.05983 -3.419686 -0.824152
H  -3.179776 -2.138334 -0.264608
H  -3.674815 -0.07777 2.159918
H  -4.592019 1.342479 1.520174
H  -2.836833 1.502819 1.913334
