program: Gaussian 09
title: 000034842
version: EM64L-G09RevD.01
frameworkgroup: C1[X(C21H28N2)]
method: RPBEPBE
basis: SDD
operation: Freq
keyword: #pfreq=noraman
keyword: PBEPBE/SDD
title: #p freq=noraman PBEPBE/SDD
converged: YES YES NO NO
title: Mulliken charges:
elementType: N N C C C C C C C C C C C C C C C C C C C C C H H H H H H H H H H H H H H H H H H H H H H H H H H H H
charge: -0.061949 -0.093458 -0.608377 -0.549009 -0.363937 0.301021 0.325805 -0.587006 -0.593677 -0.437574 0.359784 0.328855 -0.354593 -0.367121 -0.368956 -0.412115 -0.415485 -0.271450 -0.254716 -0.247520 -0.243678 -0.607440 -0.625688 0.235806 0.223503 0.212932 0.213074 0.198210 0.250640 0.223026 0.198106 0.218051 0.227501 0.215880 0.224911 0.201234 0.189125 0.234750 0.245458 0.230822 0.231381 0.225564 0.224156 0.225125 0.223730 0.224634 0.186236 0.220346 0.236987 0.219523 0.187575
chargesum: 0.00000
title: Mulliken charges with hydrogens summed into heavy atoms:
elementType: N N C C C C C C C C C C C C C C C C C C C C C
charge: -0.061949 -0.093458 -0.149068 -0.123003 0.084913 0.301021 0.325805 -0.141454 -0.152886 -0.016443 0.359784 0.328855 0.035766 -0.132371 -0.123499 -0.181293 -0.184105 -0.045886 -0.030559 -0.022395 -0.019948 0.023776 0.018397
polarizability: 2.76886255e+02 -9.36127627e+00 2.81193210e+02 -3.94243634e+00 -2.18113943e+01 1.52689169e+02
1716.lowfreq: -8.7667 -0.0002 0.0005 0.0008 2.8034 6.3614 19.3634 32.6750 44.6329
frequency: 19.1450 32.6181 44.6179 50.8937 57.9447 69.8571 86.9518 108.8898 137.5742 161.5923 172.8249 195.3721 224.0997 237.9575 244.3490 271.4036 283.8719 296.1885 326.1189 352.6112 361.9783 366.7932 383.4349 396.1507 402.5490 423.0025 447.2042 468.8220 484.9504 502.0107 529.3745 553.7112 576.3618 579.5628 610.0547 617.6245 705.6926 729.3862 736.8245 740.5073 760.0957 768.4909 773.3330 809.2095 816.2421 822.3960 829.0631 871.6199 878.1253 886.9423 906.6100 926.8705 943.9982 948.2808 952.2061 968.2421 969.1325 984.5825 985.6093 991.3601 1033.4425 1039.0237 1045.7304 1050.0850 1067.4268 1072.0417 1086.3180 1092.8061 1097.0064 1111.4211 1126.2910 1139.3523 1156.2625 1164.2049 1172.0756 1174.7050 1177.5603 1183.6120 1203.7792 1214.7779 1224.6603 1231.6190 1242.4591 1256.5192 1272.1848 1282.1891 1288.1799 1295.4740 1299.9232 1310.3341 1318.7118 1321.8886 1330.3594 1343.4541 1365.0026 1380.2810 1382.7471 1390.2609 1416.6585 1432.2986 1435.5581 1440.2944 1458.8934 1460.6486 1462.3438 1470.6986 1473.8892 1476.3695 1477.3777 1481.9135 1484.2762 1486.0208 1487.7184 1492.1810 1498.8694 1581.7691 1588.6583 1606.7948 1611.5964 2829.5990 2842.1901 2859.4609 2866.4846 2916.0608 2982.6517 2994.0510 3001.4650 3001.7109 3008.7703 3014.8706 3016.4068 3024.7746 3028.5829 3046.3692 3051.1020 3053.2756 3062.3671 3075.4106 3085.3977 3109.1642 3111.0650 3118.0159 3122.8383 3134.8566 3137.0523 3156.4290 3157.5549
redmass: 4.0299 2.6005 3.6715 3.8880 3.6316 4.0425 3.6566 4.6136 3.7190 3.4763 3.1375 1.8350 1.3302 1.6517 2.3822 2.4174 3.4487 2.1652 3.1339 2.7037 2.3420 2.5247 2.0993 2.7095 2.2765 2.0733 2.5494 2.8329 4.1863 3.6921 3.6493 3.3919 3.4675 3.2366 4.6686 4.4430 2.9722 2.8394 2.1155 3.8158 1.4568 1.5873 2.8524 2.5019 2.4696 2.8764 2.9960 1.4320 1.4708 1.8566 2.3276 1.8377 1.9065 1.5842 1.5703 2.0264 2.1738 1.4414 1.3224 2.9298 1.6041 2.5307 2.2171 2.2326 2.2728 1.9593 1.8166 1.6213 2.0418 2.0188 2.0735 1.6336 1.2443 1.4061 1.1217 1.1335 1.3290 2.0452 1.8904 1.6247 2.0490 1.7022 1.5713 1.9843 1.6207 1.5517 1.3501 1.2872 1.3301 1.2335 1.3618 1.3507 1.2548 1.4900 1.3651 4.7637 3.1923 1.7777 1.1423 2.2062 2.2792 1.1669 1.0571 1.1061 1.0592 1.0980 1.1282 1.2830 1.3806 1.1284 2.2568 1.0629 1.1220 1.1347 1.1329 6.4137 6.6791 6.1428 6.3265 1.0699 1.0575 1.0580 1.0704 1.0685 1.0625 1.0619 1.0611 1.0873 1.0598 1.0899 1.0719 1.0855 1.0719 1.0988 1.1002 1.1017 1.1025 1.1010 1.1003 1.0867 1.0865 1.0874 1.0876 1.0931 1.0939 1.1007 1.1008
irintensity: 0.0183 0.4492 0.2289 0.2442 0.1143 0.0254 0.5281 0.6232 0.4487 0.1432 2.3078 0.1306 0.8547 1.6056 0.5529 2.8441 0.3350 4.2477 10.9666 5.6831 2.0272 2.3143 1.4171 4.8288 2.3110 0.5887 3.9801 0.3071 5.0816 1.0969 12.8879 10.8132 3.2012 5.4293 15.1831 3.8834 2.4510 13.9989 21.0111 5.6941 5.7622 90.7421 29.5455 7.3493 5.7043 2.4845 2.3893 0.5837 0.2810 2.5004 1.0622 8.8828 2.3074 1.4117 6.3671 5.3640 25.0452 0.4315 0.1182 0.3381 25.9042 28.0826 12.4640 3.4082 14.6335 5.6899 35.7832 7.7809 3.2950 7.3386 3.9441 8.2203 2.5716 0.6581 0.8374 0.7814 3.4632 0.8156 7.4515 26.5034 1.5198 2.7956 8.9887 7.5921 11.2611 2.4428 4.4840 12.7023 2.4376 3.0235 1.3867 0.1044 2.4632 14.5347 7.5788 0.5023 0.9803 2.0878 2.6715 5.9744 4.3447 3.3103 5.7479 6.7579 16.1200 3.2836 20.2829 9.3522 28.4065 1.8098 9.7275 18.3676 5.8739 9.8940 33.5154 0.5438 0.4533 1.7950 1.0923 60.0141 70.6904 299.4079 55.0168 57.0706 28.8767 25.0870 27.1141 16.2475 43.0198 18.5341 40.5075 16.4712 29.6333 63.2532 23.2924 33.8945 21.1788 34.6858 43.4434 13.2969 10.0451 2.9775 3.3640 34.7945 34.5684 43.7938 30.5533
temp: 298.150 k
press: 1.00000 atm
elementType: 7 7 6 6 6 6 6 6 6 6 6 6 6 6 6 6 6 6 6 6 6 6 6 1 1 1 1 1 1 1 1 1 1 1 1 1 1 1 1 1 1 1 1 1 1 1 1 1 1 1 1
symmnumber: 1
zpe: 1159541.9 jmol-1
zpe.correction: 0.441646 hartree
zpe.thermalcorrener: 0.463368 hartree
zpe.thermalcorrenthalpy: 0.464312 hartree
zpe.thermalcorrgfe: 0.389909 hartree
zpe.sumelectzpe: -924.780037 hartree
zpe.sumelectthermal: -924.758315 hartree
zpe.sumelectthermalent: -924.757371 hartree
zpe.sumelectthermalfe: -924.831774 hartree
dipole: -1.0012 0.5358 0.0912
dipole: 1.1392
quadrupole: -121.7431 -134.3010 -143.2039
quadrupole: 1.2969 -1.5120 -4.1998
quadrupole: 11.3396 -1.2183 -10.1212 1.2969 -1.5120 -4.1998
hfenergy: -925.2216833 hartree
pointgroup: C01 [X(C21H28N2)]
dipole: 0.4167275 0.1604803 -0.0383238 debye
polarizability: 279.2303803|9.738156|278.8102178|-1.9765564|22.1286643|152.728036 unknown
InChI: InChI=1S/C21H28N2/c1-22(2)14-7-15-23-16-20-10-5-3-8-18(20)12-13-19-9-4-6-11-21(19)17-23/h3-6,8-11H,7,12-17H2,1-2H3
charge 0 multiplicity 1
51 atoms
N  0.54657 -0.489888 -0.249091
N  4.754437 -1.384641 0.389356
C  -0.064121 0.471907 -1.221184
C  -0.337326 -0.798716 0.911747
C  1.945089 -0.207514 0.159356
C  -0.320481 1.881427 -0.671114
C  -1.588009 -1.560854 0.48903
C  -2.876206 1.488733 -0.29553
C  -3.156973 0.467994 0.875893
C  2.946591 -0.286296 -1.010783
C  -1.593707 2.311803 -0.179688
C  -2.891456 -0.98504 0.499953
C  4.411326 -0.262769 -0.519701
C  0.775233 2.786165 -0.606394
C  -1.427398 -2.904868 0.062615
C  -1.698129 3.606254 0.39955
C  -3.993616 -1.787627 0.094711
C  0.654975 4.068799 -0.032743
C  -2.527088 -3.688884 -0.341053
C  -0.592477 4.477653 0.48987
C  -3.824275 -3.124619 -0.321084
C  6.034274 -1.152604 1.088988
C  4.727626 -2.701625 -0.278417
H  -1.002099 0.010243 -1.576071
H  0.612967 0.531759 -2.09185
H  -0.603444 0.114851 1.490367
H  0.255852 -1.440166 1.590754
H  2.059072 0.775415 0.68004
H  2.241052 -0.981611 0.891811
H  2.736671 -1.20163 -1.595651
H  2.820625 0.564782 -1.709613
H  -3.721258 2.201489 -0.327039
H  -2.907291 0.93797 -1.253145
H  -4.222111 0.559112 1.158629
H  -2.574376 0.774958 1.763178
H  4.584056 0.678018 0.040198
H  5.092213 -0.238651 -1.411684
H  1.737509 2.479605 -1.033979
H  -0.414783 -3.324708 0.040765
H  -2.676251 3.940302 0.76908
H  -4.999791 -1.349631 0.108808
H  1.518344 4.743039 -0.00146
H  -2.378837 -4.725917 -0.662777
H  -0.708794 5.470502 0.938949
H  -4.69279 -3.721118 -0.623007
H  5.984779 -0.203152 1.651744
H  6.916147 -1.100211 0.399545
H  6.217531 -1.968521 1.811319
H  3.719696 -2.913473 -0.673685
H  4.973452 -3.490535 0.454759
H  5.455598 -2.777813 -1.12737
