program: Gaussian 09
title: 000034742
version: EM64L-G09RevD.01
frameworkgroup: C1[X(C5H10O2)]
method: RPBEPBE
basis: SDD
operation: Freq
keyword: #pfreq=noraman
keyword: PBEPBE/SDD
title: #p freq=noraman PBEPBE/SDD
converged: YES YES NO NO
title: Mulliken charges:
elementType: O O C C C C C H H H H H H H H H H
charge: -0.262591 -0.455393 -0.131451 -0.007122 -0.492568 -0.274613 -0.691198 0.222924 0.199167 0.221415 0.228790 0.202635 0.217458 0.200232 0.257916 0.224479 0.339920
chargesum: 0.00000
title: Mulliken charges with hydrogens summed into heavy atoms:
elementType: O O C C C C C
charge: -0.262591 -0.115473 0.091473 0.192045 -0.042363 0.145480 -0.008571
polarizability: 6.54979102e+01 7.96757699e-01 5.67995179e+01 -1.69836094e+00 -1.86175002e-02 5.27922113e+01
1716.lowfreq: -8.6750 0.0004 0.0008 0.0011 5.6977 25.3768 81.1229 189.3875 204.1683
frequency: 80.7330 189.3861 204.1616 262.8763 271.3510 355.5176 399.4132 495.1048 631.9384 713.4208 758.8722 836.2089 844.0977 889.6882 945.0502 971.7726 1017.8604 1031.6537 1062.4433 1114.4964 1126.4664 1155.4224 1170.4667 1195.3265 1268.8502 1295.4849 1318.0763 1342.1277 1344.1696 1363.4968 1388.0145 1454.9494 1460.5743 1471.3113 1482.9634 2960.2631 2983.5556 2986.4668 2997.0564 3011.0976 3065.9707 3078.2707 3087.8498 3125.5697 3568.0778
redmass: 3.5718 2.4688 1.0790 2.3195 1.2428 3.1738 2.2762 3.5818 2.5670 3.3609 4.0495 3.1324 2.0199 2.5133 2.1480 2.0585 1.8123 1.6715 2.3890 1.6708 2.1449 1.2422 1.5922 1.2750 1.2745 1.2443 1.3350 1.3148 1.3468 1.5966 1.2383 1.0958 1.0489 1.0571 1.0896 1.0839 1.0663 1.0759 1.0402 1.0678 1.1003 1.1054 1.0980 1.0999 1.0662
irintensity: 5.4053 3.6583 1.3188 26.6346 131.8183 1.3387 2.7331 5.8653 3.8950 8.1620 22.5167 7.8917 9.3781 16.7563 45.5975 35.4977 22.2303 19.5772 54.0516 30.3887 5.6380 23.5113 3.3896 11.3040 11.7017 11.4326 1.4218 1.0497 4.3063 3.7553 23.2966 14.4197 10.0765 9.5982 1.6459 28.3823 108.4003 16.1693 35.1292 52.3263 26.6142 52.7556 29.7518 19.0716 4.3047
temp: 298.150 k
press: 1.00000 atm
elementType: 8 8 6 6 6 6 6 1 1 1 1 1 1 1 1 1 1
symmnumber: 1
zpe: 381476.7 jmol-1
zpe.correction: 0.145297 hartree
zpe.thermalcorrener: 0.152762 hartree
zpe.thermalcorrenthalpy: 0.153706 hartree
zpe.thermalcorrgfe: 0.113977 hartree
zpe.sumelectzpe: -346.371648 hartree
zpe.sumelectthermal: -346.364183 hartree
zpe.sumelectthermalent: -346.363239 hartree
zpe.sumelectthermalfe: -346.402968 hartree
dipole: 1.9686 2.4414 1.5876
dipole: 3.5151
quadrupole: -39.9565 -43.7228 -42.4165
quadrupole: 2.2811 -1.8479 -0.0678
quadrupole: 2.0755 -1.6909 -0.3846 2.2811 -1.8479 -0.0678
hfenergy: -346.5169447 hartree
pointgroup: C01 [X(C5H10O2)]
dipole: -0.7869258 -0.9802807 0.5765205 debye
dipolederiv: -0.8516982 0.03351 -0.1720441 0.1150478 -0.4642954 0.0769682 -0.1650266 0.0672307 -0.4591466 -0.39444 0.2642901 -0.0405377 0.2552275 -0.5362873 -0.1984678 -0.0277579 -0.219595 -0.6304887 0.228262 -0.1622099 0.008503 -0.1078213 0.3853928 0.166334 -0.0168716 0.214312 0.5206115 0.5265326 -0.1361837 0.0561466 -0.2445293 0.2979331 -0.1331097 0.1881489 -0.0594893 0.4385832 -0.1452234 0.1247706 0.0375016 -0.009656 -0.0854119 0.0859824 -0.0452055 0.0822608 0.0271281 0.5760836 -0.0386447 0.1568916 0.1343636 0.2661111 0.1273844 0.1159919 0.0117433 0.3665607 -0.1393039 0.039712 0.0637741 -0.0170849 0.0344094 -0.003965 0.077385 -0.0279188 -0.0105156 0.0442086 0.0567361 -0.0263822 0.0442213 -0.0838135 0.097303 -0.0227973 0.0718424 -0.1712123 -0.0054513 0.0161835 -0.0033273 0.0327036 0.0036678 -0.032525 -0.0617345 -0.0310932 -0.2262314 0.0688546 0.0355513 0.038113 0.0428044 0.039383 -0.0629879 0.0795454 -0.0321254 -0.1380628 -0.0514662 -0.1127841 -0.023482 -0.1335525 -0.0395394 -0.0425243 -0.0659298 -0.0551012 0.0715135 -0.0047346 -0.0105508 -0.017394 -0.0710487 0.0392546 -0.1007987 -0.083682 -0.0334949 -0.1937236 -0.1077388 0.1201996 -0.0198129 0.1261142 -0.0538751 -0.0027232 0.0133295 -0.0353914 0.0733191 -0.0269626 0.0873874 -0.0554483 0.124881 -0.0023805 0.0915707 -0.0814806 0.0929705 0.0189394 0.1023722 0.0057749 -0.0314133 0.0152695 0.1043532 -0.0570454 0.0169582 -0.0520116 -0.0743919 0.0143456 -0.089436 0.0085139 -0.1321942 -0.0964785 -0.0040317 0.0174009 -0.0126309 0.1016365 0.1663597 -0.2343063 0.0203979 -0.1747461 0.1915766 -0.0073639 0.0617262 0.0184921 0.2854808 unknown
polarizability: 65.5527892|0.5421202|56.7619155|1.6226382|0.2092735|52.7749346 unknown
InChI: InChI=1S/C5H10O2/c1-4-5(6)2-3-7-4/h4-6H,2-3H2,1H3
charge 0 multiplicity 1
17 atoms
O  -0.040082 1.451453 -0.085501
O  0.191345 -1.635382 -0.713614
C  -0.128946 -0.902605 0.523598
C  0.756339 0.36937 0.575415
C  -1.561177 -0.315168 0.477645
C  -1.368706 0.905806 -0.444861
C  2.128676 0.259648 -0.0911
H  0.043064 -1.548254 1.408516
H  0.870173 0.663889 1.640006
H  -1.860173 0.010981 1.49157
H  -2.310406 -1.03567 0.103532
H  -1.36851 0.600052 -1.510202
H  -2.112521 1.704761 -0.285287
H  2.771265 -0.454759 0.456298
H  2.023679 -0.091192 -1.128761
H  2.619118 1.248254 -0.087133
H  -0.416936 -2.412784 -0.790621
