program: Gaussian 09
title: 000034840
version: EM64L-G09RevD.01
frameworkgroup: C1[X(C23H27N7)]
method: RPBEPBE
basis: SDD
operation: Freq
keyword: #pfreq=noraman
keyword: PBEPBE/SDD
title: #p freq=noraman PBEPBE/SDD
converged: YES YES NO NO
title: Mulliken charges:
elementType: N N N N N N N C C C C C C C C C C C C C C C C C C C C C C C H H H H H H H H H H H H H H H H H H H H H H H H H H H
charge: -0.086399 -0.176714 -0.140402 -0.112380 -0.120337 -0.129441 -0.585747 -0.369010 -0.355631 -0.404687 -0.382913 -0.434085 -0.422484 -0.532740 -0.502240 0.470765 0.298803 0.255943 0.095275 0.128398 -0.402334 -0.358269 -0.379099 -0.382670 -0.239773 -0.248838 0.000155 -0.234557 -0.226620 -0.271254 0.250340 0.179803 0.182945 0.209385 0.212199 0.211430 0.217649 0.202576 0.221782 0.197829 0.222673 0.273068 0.220549 0.239363 0.290348 0.231951 0.233220 0.231090 0.231047 0.214634 0.227742 0.228309 0.216080 0.216716 0.223495 0.334116 0.328945
chargesum: 0.00000
title: Mulliken charges with hydrogens summed into heavy atoms:
elementType: N N N N N N N C C C C C C C C C C C C C C C C C C C C C C C
charge: -0.086399 -0.176714 -0.140402 -0.112380 -0.120337 -0.129441 0.077314 0.061133 0.036699 0.018942 0.037311 -0.014474 0.073257 -0.072827 0.020059 0.470765 0.298803 0.255943 0.095275 0.128398 -0.169114 -0.127179 -0.148053 -0.168035 -0.012030 -0.020529 0.000155 -0.018476 -0.009904 -0.047760
polarizability: 3.66371264e+02 9.49137005e+00 3.00599658e+02 -5.99476158e+00 3.28523922e+01 2.53196052e+02
1716.lowfreq: -2.5730 -0.0002 0.0008 0.0010 2.8657 7.0240 10.2414 21.3587 26.0808
frequency: 8.7486 21.2493 25.0674 32.4064 33.8235 56.9883 66.2155 66.8769 115.6009 120.2165 141.9717 162.2596 168.4397 184.8638 201.8565 212.2022 244.6182 248.1865 255.1548 273.8613 284.0201 308.3509 318.0099 339.0884 352.6863 395.9706 408.6766 411.8809 427.6206 433.1352 458.2114 472.9837 483.3763 498.6578 503.2852 516.0061 529.2960 547.7409 554.1268 576.1318 586.2041 599.3515 614.0572 628.6752 663.4382 689.9442 707.8903 713.5198 717.7687 718.7368 727.3012 752.4918 754.9795 778.2384 811.3384 816.2279 822.7594 847.2267 853.4844 867.6080 871.1018 900.9956 916.9000 923.3800 930.8420 938.9059 954.1745 963.6424 973.6183 976.9454 979.1851 986.1013 990.0141 1003.7218 1008.2115 1031.7141 1037.8001 1044.5841 1057.7859 1059.4831 1064.4438 1087.8237 1092.0534 1106.2978 1125.5374 1133.3504 1148.7834 1168.4554 1169.7077 1174.0862 1176.2779 1191.6548 1199.5182 1200.6199 1206.9666 1226.6661 1229.2549 1235.7601 1240.3714 1253.6353 1270.9355 1287.4581 1291.6765 1297.1249 1323.4315 1327.9311 1335.3887 1342.0484 1343.1484 1355.1645 1361.3517 1363.4124 1371.2044 1379.7235 1384.3809 1386.0536 1397.3048 1432.0013 1441.2794 1446.1722 1449.8967 1452.5826 1459.0515 1462.7669 1464.1146 1467.8060 1472.2797 1474.1264 1476.2552 1492.3032 1496.3375 1524.5881 1545.5524 1577.3143 1594.3695 1613.3023 1617.4318 1618.5343 2849.0354 2855.6841 2896.7417 2911.9122 2923.3596 2933.7908 2974.6402 2981.4324 3034.3805 3037.8539 3055.5521 3056.7529 3062.0517 3069.2950 3090.6548 3107.9175 3112.4393 3117.1074 3119.3666 3125.8472 3137.9769 3148.3595 3157.0480 3160.1052 3168.2089 3554.9903 3715.3462
redmass: 6.1106 5.1329 3.8612 4.0848 4.6091 4.8423 3.0556 4.1969 4.3855 4.3724 4.5251 3.6732 4.8042 5.3267 5.1492 4.1815 2.6665 3.0200 2.5670 3.0013 3.4167 3.8761 2.7216 2.3002 4.1263 2.1421 2.9019 2.8278 2.6087 3.6461 3.1903 2.6416 1.2877 3.8739 3.9512 2.8244 4.7429 1.0848 4.2404 5.5048 5.0014 4.7878 6.2166 2.6840 3.0880 1.7935 4.1482 8.5802 4.0172 3.6943 4.4945 1.2772 1.8903 4.8202 1.8345 2.2137 4.4905 1.5582 3.5786 1.3487 1.5199 11.2777 3.0707 2.5791 2.3424 1.4474 1.3785 2.1882 1.3214 5.1310 2.2368 1.3418 2.5119 2.4488 2.4639 2.1637 2.2759 2.4209 2.0437 2.0801 2.0468 1.7013 2.2297 2.1192 2.2351 2.3299 2.8733 2.0441 1.1186 1.0856 1.9191 1.2355 1.1432 2.0757 1.1339 1.8594 2.3263 1.9338 1.6567 1.7644 1.8086 1.5744 1.4865 1.3566 1.3823 1.5374 1.4910 1.4278 1.3682 1.9324 1.6660 1.6026 1.8901 1.6247 3.5639 4.6111 1.9839 4.1995 2.4331 2.4539 1.0986 1.1219 1.1066 1.0952 1.1363 2.3455 1.5170 1.2326 1.1047 2.0376 2.4186 3.4134 3.8785 5.9312 6.3617 2.0905 5.7057 5.2558 1.0708 1.0697 1.0691 1.0691 1.0708 1.0709 1.0689 1.0622 1.0896 1.0996 1.0915 1.0883 1.0884 1.0900 1.0893 1.0940 1.0868 1.0891 1.0842 1.0884 1.0928 1.0920 1.0940 1.1005 1.0994 1.0441 1.1058
irintensity: 0.0355 0.0314 0.0518 0.1481 0.0973 0.0884 1.7922 0.4749 0.3300 5.5977 1.0421 0.4667 4.4173 2.4539 3.7094 1.6627 3.5432 5.2741 3.7357 2.6400 4.8305 0.2734 12.0421 4.8904 3.3972 2.5822 0.6857 2.1752 5.4702 1.7862 1.9336 10.4819 257.0944 0.2077 23.2726 16.3109 1.5879 0.4103 10.1879 8.3379 3.5784 10.4034 0.5895 1.3186 4.9396 41.3796 2.7313 1.3623 4.9612 2.5918 0.1076 74.3350 75.3127 27.0672 7.8935 11.0566 8.1171 0.9487 6.7133 0.0964 6.2912 26.2291 9.2953 35.8091 52.8699 3.8271 0.0864 4.1657 1.0593 5.3542 31.5029 0.4193 2.7272 53.6474 25.2690 11.7929 5.9078 4.6351 9.7702 1.1142 3.9678 4.4092 4.1001 23.6292 34.0438 52.0609 25.2411 4.5278 0.2971 0.6354 6.6136 4.5444 1.0642 0.4194 0.7244 17.7592 22.4368 118.9783 115.4603 25.1717 65.0668 99.4247 9.5303 3.7786 5.4418 13.9416 22.0210 0.9607 7.2474 11.2060 20.1608 3.5777 33.3763 20.7307 20.5473 13.1940 1.3362 43.6746 6.4764 1.1353 10.4197 12.0443 11.7626 21.8909 95.9528 275.8281 103.8174 111.7937 8.2312 20.4056 141.3184 508.7157 928.6438 9.5194 11.2573 324.7500 75.8363 131.0756 44.5437 118.1005 103.8611 60.7081 102.9271 42.9256 42.2456 36.7692 38.8097 46.3614 25.6389 15.0484 10.1812 14.3372 23.2459 3.6137 12.7815 2.4472 10.4210 10.4783 26.9077 41.0405 42.6182 36.5790 6.7098 104.2631 45.1529
temp: 298.150 k
press: 1.00000 atm
elementType: 7 7 7 7 7 7 7 6 6 6 6 6 6 6 6 6 6 6 6 6 6 6 6 6 6 6 6 6 6 6 1 1 1 1 1 1 1 1 1 1 1 1 1 1 1 1 1 1 1 1 1 1 1 1 1 1 1
symmnumber: 1
zpe: 1237328.2 jmol-1
zpe.correction: 0.471273 hartree
zpe.thermalcorrener: 0.497033 hartree
zpe.thermalcorrenthalpy: 0.497978 hartree
zpe.thermalcorrgfe: 0.412206 hartree
zpe.sumelectzpe: -1273.746527 hartree
zpe.sumelectthermal: -1273.720768 hartree
zpe.sumelectthermalent: -1273.719823 hartree
zpe.sumelectthermalfe: -1273.805595 hartree
dipole: -3.6958 1.5704 0.5764
dipole: 4.0568
quadrupole: -180.7493 -162.1153 -163.1693
quadrupole: 0.5374 -7.9030 13.7652
quadrupole: -12.0713 6.5627 5.5087 0.5374 -7.9030 13.7652
hfenergy: -1274.2178009 hartree
pointgroup: C01 [X(C23H27N7)]
dipole: 1.5191445 0.4160562 -0.2578323 debye
polarizability: 364.6007798|-13.6743407|281.1390303|1.8943465|-41.4885562|274.4271633 unknown
InChI: InChI=1S/C23H27N7/c24-22-25-21(17-28-12-14-29(15-13-28)20-8-2-1-3-9-20)26-23(27-22)30-11-10-18-6-4-5-7-19(18)16-30/h1-9H,10-17,24H2
charge 0 multiplicity 1
57 atoms
N  -1.690805 1.228107 0.744152
N  -4.268414 0.192626 -0.072574
N  3.772555 0.555831 0.340211
N  1.604774 1.34283 0.837789
N  0.603758 3.032845 -0.586577
N  2.850944 2.200075 -1.08009
N  1.83554 3.839378 -2.408654
C  -2.427043 1.830072 -0.392398
C  -2.651385 0.720802 1.750959
C  -3.348991 0.794029 -1.059239
C  -3.561322 -0.342866 1.11401
C  -0.669041 2.136703 1.327838
C  5.01319 0.516455 -0.456613
C  5.194155 -0.895073 -1.052262
C  3.703881 -0.354637 1.49671
C  -5.479842 -0.400103 -0.506278
C  5.083619 -1.966365 0.026182
C  4.372258 -1.700871 1.227547
C  0.58743 2.173026 0.476748
C  2.723016 1.383152 0.020848
C  5.686849 -3.237525 -0.151039
C  4.283565 -2.70629 2.222397
C  -5.813117 -0.499921 -1.893008
C  -6.44035 -0.884849 0.436496
C  5.589581 -4.237182 0.839252
C  4.882771 -3.968985 2.03566
C  1.770467 2.995476 -1.329435
C  -7.049995 -1.039452 -2.306228
C  -7.666603 -1.430128 0.010391
C  -7.990993 -1.51212 -1.364989
H  -1.700192 2.2102 -1.12988
H  -3.048263 2.697321 -0.048304
H  -3.2879 1.542319 2.170285
H  -2.088251 0.258615 2.582675
H  -3.939699 1.313631 -1.833272
H  -2.725159 0.016344 -1.557885
H  -2.930851 -1.213273 0.820917
H  -4.288838 -0.689097 1.863834
H  -0.384821 1.744756 2.318683
H  -1.054203 3.177536 1.44792
H  5.87003 0.760212 0.203973
H  4.934872 1.284263 -1.239822
H  6.175722 -0.964173 -1.558716
H  4.419256 -1.054489 -1.828216
H  2.638251 -0.480751 1.752011
H  4.184779 0.124725 2.37771
H  6.24026 -3.439437 -1.076891
H  3.733665 -2.497081 3.14899
H  -5.100212 -0.180032 -2.658185
H  -6.245267 -0.80873 1.510904
H  6.061646 -5.213672 0.683939
H  4.799981 -4.736963 2.812598
H  -7.270064 -1.101642 -3.378792
H  -8.381288 -1.783571 0.763288
H  -8.947361 -1.934056 -1.690813
H  1.045196 4.448963 -2.601864
H  2.674958 3.85534 -2.981693
