program: Gaussian 09
title: 000034732
version: EM64L-G09RevD.01
frameworkgroup: C1[X(C9H18O2)]
method: RPBEPBE
basis: SDD
operation: Freq
keyword: #pfreq=noraman
keyword: PBEPBE/SDD
title: #p freq=noraman PBEPBE/SDD
converged: NO YES NO NO
title: Mulliken charges:
elementType: O O C C C C C C C C C H H H H H H H H H H H H H H H H H H
charge: -0.313142 -0.430968 -0.134186 0.343279 0.336369 -0.217675 -0.765319 -0.727954 -0.728079 -0.705199 -0.726020 0.239054 0.207682 0.217570 0.247622 0.213485 0.225525 0.226464 0.202131 0.211342 0.232134 0.212407 0.196073 0.227643 0.229141 0.233925 0.187302 0.224163 0.335231
chargesum: 0.00000
title: Mulliken charges with hydrogens summed into heavy atoms:
elementType: O O C C C C C C C C C
charge: -0.313142 -0.095737 0.104868 0.343279 0.336369 -0.009993 -0.086642 -0.073832 -0.072196 -0.052343 -0.080630
polarizability: 1.16541564e+02 5.02451466e-02 9.74323850e+01 4.93307858e-01 4.91785880e-01 9.29227915e+01
1716.lowfreq: 0.0005 0.0006 0.0007 8.8501 16.5883 22.1045 44.0972 92.9325 173.2219
frequency: 43.9503 92.9047 173.2192 186.1318 201.0493 210.2286 222.7602 236.5289 242.8724 265.8806 274.3708 287.7543 291.4223 317.7361 345.5808 372.8287 391.4766 478.6732 505.1574 523.7994 540.7157 566.9297 729.3627 767.1140 806.0543 881.9980 894.5769 917.6422 920.8730 947.0648 977.3158 982.0060 985.5002 1020.2043 1042.3016 1082.1428 1100.8037 1130.7363 1165.2221 1175.9371 1197.3163 1230.6770 1246.2769 1271.6172 1297.4206 1316.4996 1342.2526 1371.6087 1374.7395 1382.3810 1386.1473 1390.9927 1397.4518 1447.2069 1451.7719 1458.8954 1462.5740 1467.3520 1472.3617 1476.0496 1477.6073 1482.6785 1488.7187 2941.8930 2972.4144 2980.2692 2981.1764 2985.7508 2990.7447 2992.4380 3066.8563 3072.8527 3076.0823 3081.8758 3085.2838 3086.0410 3090.8995 3092.3980 3094.7528 3102.9969 3560.3432
redmass: 3.3971 3.3726 1.0501 1.1271 1.5753 1.2127 1.9864 1.5260 1.7582 1.8813 1.4413 1.7534 1.3351 2.6738 2.5878 2.7424 3.4063 3.2191 2.7064 3.4646 3.2712 4.2879 3.3605 3.4505 2.4888 3.0761 2.1126 1.5107 1.4804 1.9567 1.6514 1.3088 1.3945 3.2087 1.6178 1.8436 1.7557 2.2586 2.0498 2.3570 2.4882 1.7612 2.5900 2.7783 1.5514 1.5985 1.4116 1.2685 1.2399 1.3183 1.2951 1.2114 1.2844 1.0499 1.0508 1.0522 1.0499 1.0557 1.0618 1.0559 1.0497 1.0563 1.0527 1.0836 1.0377 1.0355 1.0360 1.0370 1.0367 1.0814 1.0963 1.0991 1.0987 1.0990 1.0981 1.0993 1.0999 1.1002 1.0995 1.1002 1.0663
irintensity: 1.6290 0.2928 2.3235 0.1823 1.9531 0.6214 0.3101 6.8379 2.0798 1.8343 1.2583 45.1787 89.8236 2.2038 2.9240 1.3330 10.8719 7.2742 6.7602 1.3861 0.7793 0.9834 5.6738 1.3508 3.5521 48.0865 24.3908 1.4620 0.8217 50.8320 2.4587 3.6412 1.5480 102.1701 5.6081 3.2950 31.6047 43.1870 5.3426 15.8657 7.9081 15.2783 28.8647 10.2518 24.9945 1.3726 4.5851 10.5333 48.2934 6.3204 10.3356 41.5588 1.1114 0.7060 2.7066 4.7632 6.5463 4.3016 18.1746 7.6422 9.9870 11.1849 12.7255 36.7977 30.3372 22.1995 21.5087 41.1145 15.6642 20.4421 22.0135 29.3675 6.3942 58.2755 22.6857 40.2066 12.7995 39.9173 40.6479 34.2741 3.1794
temp: 298.150 k
press: 1.00000 atm
elementType: 8 8 6 6 6 6 6 6 6 6 6 1 1 1 1 1 1 1 1 1 1 1 1 1 1 1 1 1 1
symmnumber: 1
zpe: 666586.1 jmol-1
zpe.correction: 0.253889 hartree
zpe.thermalcorrener: 0.267396 hartree
zpe.thermalcorrenthalpy: 0.268340 hartree
zpe.thermalcorrgfe: 0.215801 hartree
zpe.sumelectzpe: -503.283633 hartree
zpe.sumelectthermal: -503.270126 hartree
zpe.sumelectthermalent: -503.269182 hartree
zpe.sumelectthermalfe: -503.321722 hartree
dipole: -0.4671 0.7159 -1.0861
dipole: 1.3821
quadrupole: -61.9617 -75.7671 -68.7998
quadrupole: -1.0819 2.4825 -2.2837
quadrupole: 6.8812 -6.9242 0.0431 -1.0819 2.4825 -2.2837
hfenergy: -503.5375225 hartree
pointgroup: C01 [X(C9H18O2)]
dipole: 0.1917841 0.2819776 0.4235516 debye
polarizability: 116.545816|-0.2747308|97.4302298|0.2251293|-0.520425|92.9206945 unknown
InChI: InChI=1S/C9H18O2/c1-6-7(10)9(4,5)11-8(6,2)3/h6-7,10H,1-5H3
charge 0 multiplicity 1
29 atoms
O  0.047007 -1.388173 -0.005646
O  1.426337 2.034381 -0.215438
C  -0.721343 0.891049 -0.300982
C  -1.218849 -0.563358 -0.034902
C  1.26096 -0.509878 0.041416
C  0.674708 0.908476 0.34923
C  -1.6381 2.032679 0.164995
C  -2.088418 -1.114983 -1.177061
C  -1.915618 -0.750408 1.330433
C  1.966937 -0.577581 -1.32786
C  2.160634 -1.043151 1.169529
H  -0.55365 0.998434 -1.391915
H  0.585842 1.030977 1.452196
H  -1.810463 1.999285 1.256111
H  -1.170333 3.003429 -0.075134
H  -2.622068 1.992835 -0.338035
H  -1.542722 -1.062306 -2.135025
H  -2.349242 -2.17089 -0.986244
H  -3.027326 -0.537396 -1.270735
H  -2.908271 -0.2644 1.344953
H  -2.051966 -1.829242 1.519594
H  -1.310284 -0.33387 2.155062
H  2.943978 -0.060823 -1.310005
H  2.13462 -1.636827 -1.589238
H  1.35333 -0.11191 -2.116913
H  2.485312 -2.074625 0.947791
H  3.067448 -0.417039 1.284648
H  1.612689 -1.054265 2.128098
H  2.314051 2.086381 0.220675
