program: Gaussian 09
title: 000005505
version: EM64L-G09RevD.01
frameworkgroup: C1[X(C12H18N2O3S)]
method: RPBEPBE
basis: SDD
operation: Freq
keyword: #p
keyword: freq=noraman
keyword: PBEPBE/SDD
title: #p freq=noraman PBEPBE/SDD
converged: YES YES NO NO
title: Mulliken charges:
elementType: S O O O N N C C C C C C C C C C C C H H H H H H H H H H H H H H H H H H
charge: 1.001179 -0.483976 -0.550191 -0.301411 -0.379620 -0.677746 -0.330336 -0.393210 -0.352457 -0.055532 -0.683700 0.401138 -0.179949 -0.258635 0.453155 -0.380102 -0.367382 -0.799956 0.223307 0.196503 0.209918 0.260325 0.189825 0.197720 0.294749 0.214452 0.216228 0.209914 0.335544 0.306500 0.290892 0.245013 0.243831 0.228772 0.231300 0.243939
chargesum: 0.00000
title: Mulliken charges with hydrogens summed into heavy atoms:
elementType: S O O O N N C C C C C C C C C C C C
charge: 1.001179 -0.483976 -0.550191 -0.301411 -0.084871 -0.342202 0.089474 0.077033 0.035087 -0.055532 -0.043106 0.401138 0.126551 0.032257 0.453155 -0.135089 -0.123551 -0.095945
polarizability: 1.97174078e+02 -2.51982123e+01 1.83998652e+02 -7.82921782e+00 -9.26002872e+00 1.61181207e+02
1716.lowfreq: -27.8249 -12.2626 -9.0564 -0.0014 0.0013 0.0018 5.0201 5.6512 24.0987
frequency: -27.5217 -8.1095 24.0053 37.4804 47.6987 67.0668 75.9884 90.3985 115.1934 125.1316 135.5955 169.4907 204.4672 222.9722 226.8417 230.6987 253.0621 280.6983 288.4072 311.7854 314.8046 361.4674 382.3878 406.5316 409.9408 441.7484 487.8629 507.5457 519.6305 581.1350 620.3093 654.2044 693.7178 705.0509 711.6356 741.3897 775.5300 812.6840 817.3706 823.0200 842.6171 848.4837 909.3662 953.7920 956.6525 969.8620 979.7960 989.6105 990.7701 993.3863 1048.5123 1049.7513 1050.7208 1100.5385 1118.4027 1121.9757 1136.3123 1178.5811 1188.2226 1217.3934 1228.4607 1261.2519 1289.0087 1299.8434 1310.1296 1326.4424 1349.2668 1367.2542 1382.4865 1388.5968 1391.7761 1396.4433 1444.2320 1459.8571 1470.0817 1471.6765 1472.6249 1473.8326 1476.1552 1481.7471 1485.4221 1592.3992 1595.1759 1615.8650 2959.3802 2974.7105 2978.2423 2980.3681 2998.7888 3005.9776 3045.0369 3063.2157 3072.3220 3074.4846 3078.8357 3092.5429 3136.5491 3141.0281 3164.3495 3185.7137 3491.5655 3565.2056
redmass: 1.0222 3.7304 4.0455 4.2476 4.8590 2.1872 3.1000 3.9254 7.4812 3.1893 6.3683 4.4072 3.0542 5.6074 1.3610 7.4386 5.9346 2.0281 2.5937 4.2522 1.9135 2.8665 3.8973 2.8581 7.9555 5.2630 1.4804 2.4716 2.4861 5.7049 6.9363 4.5657 4.1847 3.4859 5.4524 1.2459 4.9835 3.7652 1.8541 1.8409 1.2579 1.8959 1.7187 1.3405 5.7868 1.8982 1.3870 1.5860 3.9437 2.6550 1.6052 2.4285 2.8036 2.6643 2.0342 1.3157 1.8874 1.7913 1.1469 3.0981 1.3293 1.2988 1.1023 1.2567 1.2682 1.6923 1.5159 1.3823 7.6001 1.2130 2.7095 1.2206 1.1317 1.0839 1.1035 2.2091 1.0848 1.0711 1.0432 1.6191 1.1080 5.9624 6.9790 6.8535 1.0592 1.0376 1.0597 1.0388 1.0672 1.0960 1.1003 1.0947 1.1006 1.0996 1.1011 1.1001 1.0893 1.0907 1.0958 1.0952 1.0787 1.0778
irintensity: 0.6479 0.1948 1.3282 1.5488 2.9293 2.4772 1.7891 3.9515 4.3463 0.8851 3.8717 0.8451 1.8188 1.9372 2.0834 10.5083 2.6579 12.0018 9.3931 10.5939 8.9695 19.5359 0.3820 0.4714 19.1452 64.4932 173.8613 57.3679 94.9965 10.8488 0.4037 50.0705 104.6046 8.2159 16.2274 48.7173 13.7359 84.5732 53.6469 22.4702 7.8013 7.8573 4.2286 1.2910 78.5272 4.5793 1.3808 3.4581 10.1754 27.6570 23.4061 21.5867 13.1036 31.1739 7.1263 5.7803 1.3521 110.5798 8.2888 3.4114 8.9851 14.5584 1.3011 3.5671 1.3659 311.3542 6.0270 15.1093 1.3484 8.9333 13.0392 16.1698 48.2162 8.0775 18.2005 29.0917 18.2742 14.3301 9.7408 322.5360 44.4290 16.9882 1.5611 141.2423 28.6628 24.4253 46.3182 24.9211 41.0668 5.1622 48.3176 18.4925 76.9618 43.1719 19.5303 15.0169 12.8520 9.0761 6.0389 7.6653 26.8466 24.6440
temp: 298.150 k
press: 1.00000 atm
elementType: 16 8 8 8 7 7 6 6 6 6 6 6 6 6 6 6 6 6 1 1 1 1 1 1 1 1 1 1 1 1 1 1 1 1 1 1
symmnumber: 1
zpe: 749807.6 jmol-1
zpe.correction: 0.285587 hartree
zpe.thermalcorrener: 0.304584 hartree
zpe.thermalcorrenthalpy: 0.305528 hartree
zpe.thermalcorrgfe: 0.236890 hartree
zpe.sumelectzpe: -1199.779013 hartree
zpe.sumelectthermal: -1199.760016 hartree
zpe.sumelectthermalent: -1199.759072 hartree
zpe.sumelectthermalfe: -1199.827710 hartree
dipole: 2.6993 5.0723 2.1007
dipole: 6.1178
quadrupole: -93.9633 -122.2735 -116.8254
quadrupole: -21.6994 2.9605 -4.1965
quadrupole: 17.0574 -11.2527 -5.8047 -21.6994 2.9605 -4.1965
hfenergy: -1200.0646 hartree
pointgroup: C01 [X(C12H18N2O3S1)]
dipole: -0.9390221 -2.1383455 0.5823146 debye
polarizability: 199.9283784|-24.703764|178.5934901|2.7008398|12.9114863|163.8320683 unknown
InChI: InChI=1S/C12H18N2O3S/c1-3-4-9-13-12(15)14-18(16,17)11-7-5-10(2)6-8-11/h5-8,13-14H,3-4,9H2,1-2H3
charge 0 multiplicity 1
36 atoms
S  1.084238 2.019005 0.593165
O  1.158058 3.040259 -0.656112
O  1.515943 2.498481 2.088254
O  -1.029973 0.651445 -1.233294
N  -2.844217 0.973885 0.212762
N  -0.662559 1.500476 0.918288
C  -4.03716 -1.137848 -0.516575
C  -3.825331 0.380859 -0.717796
C  -4.619085 -1.516472 0.863484
C  1.987055 0.419383 0.182126
C  -4.841454 -3.036877 1.016728
C  -1.49684 1.024902 -0.115534
C  1.969852 -0.053158 -1.138554
C  2.686443 -0.196888 1.231264
C  3.433544 -1.898092 -0.391478
C  2.705892 -1.226851 -1.410683
C  3.411272 -1.369944 0.926794
C  4.243048 -3.141145 -0.71212
H  -3.069949 -1.653639 -0.6738
H  -4.721074 -1.495409 -1.31358
H  -4.782918 0.921842 -0.591969
H  -3.453813 0.571961 -1.739184
H  -5.581668 -0.984752 1.016044
H  -3.932668 -1.16755 1.661715
H  -3.159684 1.266706 1.137419
H  -3.889453 -3.588207 0.902209
H  -5.26083 -3.287289 2.008343
H  -5.541626 -3.414199 0.247845
H  -1.000824 1.917879 1.793885
H  1.387246 0.460176 -1.90747
H  2.673211 0.234605 2.237183
H  2.708661 -1.628328 -2.430235
H  3.968226 -1.876935 1.722943
H  4.328437 -3.807824 0.163355
H  3.793015 -3.715442 -1.540251
H  5.271186 -2.870015 -1.021071
