program: Gaussian 09
title: 000034835
version: EM64L-G09RevD.01
frameworkgroup: C1[X(C18H24N6)]
method: RPBEPBE
basis: SDD
operation: Freq
keyword: #pfreq=noraman
keyword: PBEPBE/SDD
title: #p freq=noraman PBEPBE/SDD
converged: YES YES NO NO
title: Mulliken charges:
elementType: N N N N N N C C C C C C C C C C C C C C C C C C H H H H H H H H H H H H H H H H H H H H H H H H
charge: -0.118535 -0.101908 -0.113976 -0.135823 -0.120244 -0.586759 -0.402540 -0.377098 -0.376521 -0.395436 -0.398430 -0.373899 -0.482754 -0.533298 0.272958 0.267065 -0.433194 0.131008 0.093971 -0.384645 -0.393533 -0.250244 -0.247168 0.010159 0.219785 0.190074 0.199775 0.209003 0.209218 0.200701 0.203567 0.268379 0.275776 0.202510 0.214495 0.183657 0.186223 0.270529 0.234736 0.204707 0.191611 0.221609 0.229514 0.229476 0.223071 0.223101 0.331749 0.327577
chargesum: 0.00000
title: Mulliken charges with hydrogens summed into heavy atoms:
elementType: N N N N N N C C C C C C C C C C C C C C C C C C
charge: -0.118535 -0.101908 -0.113976 -0.135823 -0.120244 0.072567 0.007319 0.031680 0.033398 0.076510 0.079856 0.024254 -0.026001 -0.093855 0.272958 0.267065 -0.019973 0.131008 0.093971 -0.155131 -0.164056 -0.027173 -0.024067 0.010159
polarizability: 3.01185539e+02 2.02627480e+01 2.51067751e+02 -2.86320369e+00 4.12159887e-02 1.66846031e+02
1716.lowfreq: -10.1774 -6.1038 -2.9568 -0.0007 -0.0005 -0.0003 6.0334 21.4830 28.6242
frequency: 1.5859 21.3063 28.5217 37.9225 52.5096 85.3465 111.5213 137.9451 154.0433 175.6836 180.3275 199.1586 230.7281 239.7399 252.4944 258.7534 287.0404 326.8160 344.2216 382.6656 388.8229 391.2903 412.2411 427.4961 437.5370 462.8433 475.8820 489.7936 503.2593 534.3121 546.8897 570.6467 574.9159 586.6321 610.4026 641.7979 709.2402 712.5831 715.2943 732.3211 748.7239 790.1557 802.8661 805.2200 816.5925 843.7372 848.5476 854.6001 865.4752 897.7869 901.7540 926.5766 933.7018 937.8038 949.6360 978.3145 981.8814 988.0517 991.4725 1007.5979 1032.0426 1039.0856 1052.0043 1057.7856 1085.1932 1093.1600 1104.3664 1126.3161 1129.9739 1138.0707 1152.9047 1164.8169 1171.6348 1188.9089 1199.7059 1206.3044 1230.7406 1233.2040 1241.4550 1251.4371 1257.5524 1268.5957 1273.8304 1286.0490 1299.1670 1322.8802 1326.3638 1334.6769 1340.3869 1341.4524 1344.7077 1352.7519 1360.4844 1368.3887 1388.7995 1394.2195 1431.3262 1440.0550 1442.7600 1448.6031 1454.5112 1461.1076 1463.5401 1466.4991 1468.1652 1470.0278 1476.2765 1479.5592 1491.5600 1523.7707 1547.1057 1594.8357 1612.8541 1616.3552 2794.0801 2841.0741 2881.9789 2951.3198 2955.4083 2967.1975 2977.6117 2984.7223 2986.2491 3031.5899 3034.7988 3035.0779 3040.1459 3045.4520 3054.2635 3074.4322 3098.3010 3099.5704 3108.3833 3112.8954 3133.2966 3155.9593 3555.9225 3716.7813
redmass: 4.9110 3.7728 4.1981 4.0501 3.7035 4.5703 3.3633 2.8523 6.3933 3.2531 4.7044 8.0402 3.0912 2.6187 2.3544 2.4333 2.5736 2.5157 3.6631 2.6422 2.5692 2.2244 4.1958 2.5782 2.8620 3.0741 1.2889 2.2571 3.6278 3.4716 1.0830 4.2707 4.9794 3.7531 3.6579 3.2956 4.5022 4.9585 6.0686 4.3601 1.3399 3.5242 1.4981 3.6691 4.9909 3.5482 1.4334 3.4942 1.3418 2.7132 9.3026 2.4086 1.9944 1.5247 1.3090 2.7520 1.3379 2.0835 2.3398 2.3768 2.6460 2.0901 2.2977 2.2388 1.5786 2.3289 2.1265 2.2094 1.8112 2.4225 1.2725 2.3324 1.0605 1.1290 1.8584 1.8439 1.8625 2.3857 2.3728 1.3285 1.6818 1.4998 1.2154 1.5972 1.5111 1.3788 1.2622 1.3728 1.7140 1.4675 1.4417 1.7350 1.4508 2.2955 3.6429 2.0659 4.2590 1.3390 1.7294 1.1075 1.1004 1.0914 1.1091 1.2053 3.0402 1.2009 1.1087 1.1153 2.3491 3.5529 3.7450 6.7819 1.8976 6.2519 1.0713 1.0711 1.0696 1.0699 1.0703 1.0635 1.0598 1.0610 1.0613 1.0982 1.0854 1.0962 1.0909 1.1026 1.1033 1.0893 1.0920 1.0932 1.0860 1.0892 1.0929 1.1005 1.0441 1.1058
irintensity: 0.1228 0.4963 0.1480 0.2583 0.1514 1.2891 0.5522 0.8074 0.9430 0.5439 5.2515 2.4365 1.5779 0.8426 6.1672 2.5221 2.7913 2.6158 7.0254 1.2564 1.6396 3.8069 2.3475 5.6987 0.3938 13.2203 271.2393 3.3107 0.8362 3.5206 0.1608 11.3566 5.1232 4.6674 4.2836 4.8192 1.4709 1.1732 0.2707 3.2144 92.8387 9.3668 0.0931 1.4099 13.0174 5.2432 29.6323 22.1114 1.9566 4.4443 20.8249 3.2484 28.3156 26.2946 6.9031 6.6188 0.1211 0.1348 8.4773 15.4052 5.3876 22.4246 0.3447 5.5360 14.6768 50.5731 10.8135 1.1150 34.3827 24.6953 0.3089 1.6083 0.5707 9.7583 4.1048 7.1971 15.1354 13.6900 5.1992 24.4661 34.7268 6.8353 12.6229 121.8223 14.1860 28.8955 1.2710 2.9139 9.8945 11.1254 0.4060 1.9620 4.1730 2.4762 1.1767 1.6767 53.8785 1.6159 17.5881 18.0348 14.3272 13.9876 57.5647 61.8501 284.3770 20.4647 13.9798 21.5480 15.5929 480.3807 876.1762 4.2667 327.3427 1.5727 70.7773 123.4796 117.4185 15.1365 91.8001 49.2453 29.3233 35.0272 30.5156 39.6461 12.8044 69.2218 32.1977 33.3262 95.5038 15.3862 5.4802 6.7090 14.3505 2.5682 32.8395 39.9956 91.3551 43.4646
temp: 298.150 k
press: 1.00000 atm
elementType: 7 7 7 7 7 7 6 6 6 6 6 6 6 6 6 6 6 6 6 6 6 6 6 6 1 1 1 1 1 1 1 1 1 1 1 1 1 1 1 1 1 1 1 1 1 1 1 1
symmnumber: 1
zpe: 1058622.5 jmol-1
zpe.correction: 0.403208 hartree
zpe.thermalcorrener: 0.424377 hartree
zpe.thermalcorrenthalpy: 0.425321 hartree
zpe.thermalcorrgfe: 0.348829 hartree
zpe.sumelectzpe: -1027.071297 hartree
zpe.sumelectthermal: -1027.050128 hartree
zpe.sumelectthermalent: -1027.049184 hartree
zpe.sumelectthermalfe: -1027.125676 hartree
dipole: -2.8221 0.5454 -0.1472
dipole: 2.8781
quadrupole: -129.1527 -121.4819 -142.7365
quadrupole: 0.4570 3.2742 -1.1476
quadrupole: 1.9710 9.6418 -11.6128 0.4570 3.2742 -1.1476
hfenergy: -1027.4745055 hartree
pointgroup: C01 [X(C18H24N6)]
dipole: -1.122115 -0.1390839 -0.0609585 debye
polarizability: 289.2591814|24.1738296|209.5144676|-17.7813974|-47.4931971|220.3256714 unknown
InChI: InChI=1S/C18H24N6/c19-17-20-16(21-18(22-17)24-9-4-1-5-10-24)13-23-11-8-14-6-2-3-7-15(14)12-23/h2-3,6-7H,1,4-5,8-13,19H2
charge 0 multiplicity 1
48 atoms
N  -3.290191 -1.447935 0.148959
N  1.832542 0.580342 0.816062
N  -1.406169 -0.152946 0.748445
N  -2.693859 0.345336 -1.265852
N  -0.742479 1.69792 -0.673858
N  -2.008563 2.148026 -2.592957
C  -5.638843 -2.668369 1.366788
C  -5.755458 -1.761735 0.117071
C  -4.400819 -2.279568 2.210103
C  -4.446601 -1.782268 -0.707537
C  -3.11655 -2.294415 1.349078
C  2.81437 0.206734 1.860735
C  2.446741 1.410238 -0.243694
C  3.869778 -0.735001 1.250298
C  3.767262 0.844626 -0.748526
C  4.464131 -0.162418 -0.029318
C  0.577506 1.168405 1.345137
C  -2.44915 -0.398116 -0.131935
C  -0.594749 0.888662 0.41976
C  4.327002 1.357887 -1.945126
C  5.706629 -0.632617 -0.525585
C  5.562157 0.883459 -2.43442
C  6.257894 -0.120065 -1.719028
C  -1.815606 1.367306 -1.481061
H  -6.558953 -2.603208 1.977668
H  -5.542175 -3.725979 1.042912
H  -6.593679 -2.091082 -0.526685
H  -5.967072 -0.72031 0.429223
H  -4.538895 -1.265265 2.632772
H  -4.274198 -2.977769 3.059634
H  -4.291126 -2.79808 -1.13012
H  -4.472542 -1.059867 -1.536848
H  -2.243705 -1.916575 1.901854
H  -2.903025 -3.333756 1.019198
H  2.278628 -0.309134 2.677773
H  3.318856 1.106314 2.300971
H  2.62631 2.455981 0.130911
H  1.725253 1.506951 -1.074016
H  3.38028 -1.702774 1.024679
H  4.67094 -0.936176 1.988208
H  0.662953 2.272524 1.494918
H  0.349957 0.692872 2.31309
H  3.785069 2.135506 -2.498835
H  6.245053 -1.408465 0.033957
H  5.978887 1.289215 -3.363261
H  7.219472 -0.49513 -2.087618
H  -1.36848 2.918152 -2.767434
H  -2.782383 1.943165 -3.219289
