program: Gaussian 09
title: 000005536
version: EM64L-G09RevD.01
frameworkgroup: C1[X(C16H22O6)]
method: RPBEPBE
basis: SDD
operation: Freq
keyword: #pfreq=noraman
keyword: PBEPBE/SDD
title: #p freq=noraman PBEPBE/SDD
converged: YES YES NO NO
title: Mulliken charges:
elementType: O O O O O O C C C C C C C C C C C C C C C C H H H H H H H H H H H H H H H H H H H H H H
charge: -0.210400 -0.236873 -0.222113 -0.213916 -0.414803 -0.249570 0.271277 0.185397 0.182784 -0.521996 -0.472657 0.098860 0.199273 -0.539691 -0.505298 -0.243924 -0.242651 -0.243180 0.182265 -0.679587 -0.684958 -0.682348 0.241113 0.260742 0.275820 0.270832 0.292065 0.257080 0.205328 0.203282 0.209817 0.205729 0.210073 0.208818 0.236319 0.242199 0.199960 0.232142 0.233208 0.207428 0.206147 0.235775 0.236388 0.373847
chargesum: 0.00000
title: Mulliken charges with hydrogens summed into heavy atoms:
elementType: O O O O O O C C C C C C C C C C C C C C C C
charge: -0.210400 -0.236873 -0.222113 -0.213916 -0.040956 -0.249570 0.271277 0.185397 0.182784 -0.020141 -0.196837 0.098860 0.199273 -0.268859 0.043847 0.164686 0.172894 0.175711 0.182265 -0.001110 -0.012180 -0.004038
polarizability: 2.85617028e+02 6.47210094e+00 2.46333205e+02 -3.07090582e-03 2.31204769e+00 1.17986635e+02
1716.lowfreq: -3.6531 -0.0007 -0.0005 -0.0003 3.2278 6.2695 17.3020 26.1000 29.9821
frequency: 17.2487 26.0827 29.9765 39.3404 49.9541 61.2063 74.5131 88.2720 90.6927 98.3768 107.5048 112.9199 115.7285 126.1267 148.3513 187.8006 206.2067 218.1184 238.2592 241.1633 243.7047 253.2435 266.8882 285.1700 312.7639 317.7011 334.7344 394.0530 426.9092 437.7023 459.8941 490.4019 518.9431 540.2535 544.8855 589.1593 598.2687 644.3519 652.6092 693.5751 704.4993 730.7883 733.7441 799.8767 808.8373 818.1870 828.7789 829.3721 851.9477 861.7083 872.5600 889.9993 898.9463 925.4140 966.2206 1007.3657 1023.7065 1031.1911 1036.0699 1052.5497 1097.0189 1115.5685 1116.3184 1117.3735 1129.3696 1131.9252 1133.8516 1134.5798 1149.3439 1194.5143 1217.6186 1237.3626 1258.0709 1259.2005 1262.2804 1265.2644 1272.9121 1292.3830 1313.5783 1349.5190 1361.4312 1367.7058 1371.1342 1385.6055 1397.5189 1399.3168 1400.9383 1406.4177 1442.9617 1455.4359 1458.1217 1459.9477 1460.4581 1471.4948 1476.1284 1476.8539 1485.5311 1487.9156 1488.5452 1517.0827 1553.8649 1589.8649 1609.1946 1659.3879 2944.9409 2946.2309 2954.9730 2980.0096 2988.2702 2997.5436 2999.1298 2999.4861 3003.6156 3005.1614 3015.0313 3040.7718 3072.1288 3095.1227 3096.3376 3096.6116 3106.7336 3110.6482 3112.1819 3184.4543 3188.1526 3509.9805
redmass: 5.6445 4.6421 6.9362 5.3305 4.4332 4.5123 3.9900 2.6812 3.3840 3.3008 1.6385 1.7923 2.3138 2.7643 3.4902 4.8117 5.3060 4.5561 1.2745 1.2107 1.2039 4.0021 3.9619 4.0697 5.2720 4.1095 4.8644 7.6477 4.7872 4.5036 2.9751 2.9110 2.5281 5.0528 3.1777 4.1101 5.9291 2.3751 2.0784 5.7140 5.8013 2.6829 2.4020 2.8676 2.0574 1.3673 1.1680 1.1033 1.4103 3.2993 1.9205 3.4379 3.4524 3.9853 4.2422 2.2363 2.5520 2.7054 2.7337 2.7768 2.5486 2.1517 2.3000 2.2512 1.4212 4.3517 1.4470 1.4359 1.2831 2.7973 1.7406 1.8198 1.3806 1.1528 1.1559 1.1439 5.0900 1.3869 1.6731 1.7654 1.3748 1.9429 1.4187 2.9121 1.5948 1.2767 1.2778 3.0060 1.0780 1.1305 1.0393 1.0395 1.0400 1.1290 1.0582 1.0636 1.0848 1.0780 1.0790 2.5539 8.0345 9.9752 6.0303 7.9192 1.0547 1.0552 1.0552 1.0625 1.0657 1.0361 1.0366 1.0364 1.1074 1.1075 1.1076 1.0962 1.0937 1.0990 1.0988 1.0988 1.1013 1.1014 1.1013 1.0890 1.0892 1.0638
irintensity: 0.4282 0.4467 3.7225 0.4346 0.7022 3.0500 1.6731 0.0165 0.5421 2.2275 6.5588 1.1011 1.5272 1.3619 3.2023 1.4945 4.6127 1.7771 0.0111 1.6138 0.3841 0.4780 0.6025 2.3894 0.8499 1.7661 3.0110 1.5837 3.7021 26.6663 1.4134 19.4660 99.5147 2.7605 27.7824 22.7159 7.4159 49.3734 68.9582 8.1137 4.4343 2.7661 7.1345 12.8498 26.1216 43.2953 0.3910 0.2108 7.8664 2.3326 2.9304 27.9307 20.1738 74.3622 47.8116 59.0839 21.8630 158.2861 45.4222 230.6307 140.1391 0.5395 0.1406 0.6225 4.9043 214.5208 7.3054 5.5951 23.4333 459.8739 2.0115 136.8645 59.0726 0.1045 6.1377 0.0109 339.6957 33.5923 99.8168 87.7645 18.5598 53.3042 5.3480 45.9897 27.7837 2.6749 15.2866 76.0418 19.3408 71.5638 11.4289 5.3991 19.2807 54.3692 29.7159 7.4745 27.3638 1.1347 12.3613 114.5464 356.7802 80.5649 115.5478 183.1937 50.5795 30.8278 40.9209 6.5647 68.8008 26.1951 25.7750 24.9330 33.7522 37.5352 36.0178 7.8146 9.4457 29.6596 16.1022 33.6569 31.0130 29.4482 29.3142 9.4640 5.6414 22.9214
temp: 298.150 k
press: 1.00000 atm
elementType: 8 8 8 8 8 8 6 6 6 6 6 6 6 6 6 6 6 6 6 6 6 6 1 1 1 1 1 1 1 1 1 1 1 1 1 1 1 1 1 1 1 1 1 1
symmnumber: 1
zpe: 930893.5 jmol-1
zpe.correction: 0.354559 hartree
zpe.thermalcorrener: 0.379185 hartree
zpe.thermalcorrenthalpy: 0.380129 hartree
zpe.thermalcorrgfe: 0.296978 hartree
zpe.sumelectzpe: -1072.530861 hartree
zpe.sumelectthermal: -1072.506235 hartree
zpe.sumelectthermalent: -1072.505290 hartree
zpe.sumelectthermalfe: -1072.588442 hartree
dipole: -4.3997 0.0389 1.3301
dipole: 4.5965
quadrupole: -113.0768 -121.0064 -132.3334
quadrupole: -17.4449 4.0038 -0.9766
quadrupole: 9.0621 1.1324 -10.1945 -17.4449 4.0038 -0.9766
hfenergy: -1072.8854197 hartree
pointgroup: C01 [X(C16H22O6)]
dipole: -1.6394214 0.3404054 0.6832275 debye
polarizability: 285.5785582|-1.3998413|244.0319419|-12.4815888|13.6347386|120.326367 unknown
InChI: InChI=1S/C16H22O6/c1-4-20-13-10-15(22-6-3)14(21-5-2)9-11(13)12(17)7-8-16(18)19/h9-10,18H,4-8H2,1-3H3
charge 0 multiplicity 1
44 atoms
O  0.33668 2.74031 0.449261
O  -2.308864 -2.244247 0.257919
O  -3.742443 -0.037266 0.596652
O  2.613346 1.431961 -0.212471
O  6.354234 -1.913315 0.120271
O  4.587984 -2.904784 -1.008094
C  0.481745 0.335512 0.20351
C  -0.31591 1.51115 0.387093
C  -1.590449 -1.041993 0.297961
C  2.722718 -0.972842 0.12846
C  -0.198908 -0.921397 0.173514
C  1.961632 0.370927 0.030355
C  -2.36837 0.147246 0.478209
C  -1.725789 1.401893 0.524504
C  4.242674 -0.758841 0.184438
C  -0.464103 3.963367 0.666909
C  -1.533967 -3.485458 0.064168
C  -4.595012 1.157937 0.775131
C  5.015409 -1.963184 -0.300201
C  0.526836 5.123743 0.691246
C  -2.53865 -4.633777 0.053132
C  -6.033779 0.657904 0.862581
H  2.375798 -1.545795 1.00818
H  2.484999 -1.592487 -0.760241
H  0.393966 -1.825565 0.025986
H  -2.324465 2.302604 0.668427
H  4.501937 0.112073 -0.452333
H  4.58909 -0.487411 1.196337
H  -1.19713 4.077385 -0.158833
H  -1.016037 3.88194 1.626921
H  -0.976375 -3.428082 -0.894099
H  -0.80218 -3.597877 0.891739
H  -4.455403 1.84006 -0.088688
H  -4.293912 1.687972 1.702274
H  1.255516 4.994406 1.508917
H  1.084409 5.173352 -0.258743
H  -0.009272 6.078877 0.840586
H  -3.09218 -4.675597 1.006491
H  -3.267384 -4.504193 -0.764924
H  -2.013247 -5.595162 -0.092171
H  -6.723652 1.511289 0.994416
H  -6.155599 -0.028472 1.71729
H  -6.313556 0.118106 -0.05764
H  6.839763 -2.698169 -0.25434
