program: Gaussian 09
title: 000034746
version: EM64L-G09RevD.01
frameworkgroup: C1[X(C21H13Cl)]
method: RPBEPBE
basis: SDD
operation: Freq
keyword: #p
keyword: freq=noraman
keyword: PBEPBE/SDD
title: #p freq=noraman PBEPBE/SDD
converged: YES YES NO NO
title: Mulliken charges:
elementType: Cl C C C C C C C C C C C C C C C C C C C C C H H H H H H H H H H H H H
charge: -0.087320 0.035774 -0.027356 0.389414 0.300728 0.511655 0.158252 0.497849 0.423057 0.503475 -0.808662 -0.761858 -0.446980 -0.517256 -0.483344 -0.459212 -0.349137 -0.846120 -0.477876 -0.246067 -0.258822 -0.250611 0.269210 0.242388 0.225986 0.238416 0.246888 0.244825 0.224607 0.274270 0.289798 0.252308 0.230621 0.229243 0.231858
chargesum: 0.00000
title: Mulliken charges with hydrogens summed into heavy atoms:
elementType: Cl C C C C C C C C C C C C C C C C C C C C C
charge: -0.087320 0.035774 -0.027356 0.389414 0.300728 0.511655 0.158252 0.497849 0.423057 0.503475 -0.539452 -0.519470 -0.220994 -0.278839 -0.236456 -0.214387 -0.124530 -0.282051 -0.225568 -0.015446 -0.029578 -0.018753
polarizability: 4.32648951e+02 -1.34328677e+01 2.85450169e+02 -1.21635380e+00 -1.19905712e+01 1.01588741e+02
1716.lowfreq: -12.4545 -4.4466 -0.0009 0.0008 0.0017 6.5773 48.4494 56.7873 66.8680
frequency: 48.4143 56.7849 66.8616 90.2457 151.4455 168.5233 201.6279 207.7519 271.8389 275.6231 293.9163 325.8965 338.1711 373.9031 407.4694 455.5618 461.7292 468.5100 511.5389 516.4749 521.8278 531.5808 557.8579 568.0695 574.9208 595.5592 626.4811 644.4731 677.8644 693.9274 702.5384 738.2076 762.1884 779.4124 786.0000 804.8282 838.1995 854.7935 863.1838 870.7305 879.9202 901.8104 922.4874 937.3878 946.8763 949.1367 963.5751 977.4747 988.5168 992.6116 1020.9342 1036.5291 1050.8704 1080.6389 1119.0395 1133.3260 1160.2795 1176.7929 1190.5972 1193.6206 1223.7320 1237.8462 1248.0836 1257.9565 1274.1440 1295.0431 1322.4104 1332.6983 1382.6740 1402.9313 1410.9887 1416.6965 1429.1607 1434.3917 1439.9647 1462.0697 1467.1123 1477.2625 1501.6588 1522.7926 1570.4783 1589.5383 1600.9639 1605.9214 1625.1045 1635.0259 3064.6484 3120.0387 3124.2546 3125.3935 3129.0802 3133.9611 3135.4830 3143.5755 3147.2054 3151.5510 3159.4918 3163.4829 3169.8521
redmass: 6.9512 8.2300 6.0652 4.6014 5.7758 4.9385 4.2879 4.8448 3.1782 4.6882 4.2450 4.0883 6.2123 5.3394 4.1195 4.8995 3.8422 4.5873 3.4861 5.4919 5.3725 4.4909 3.4962 3.3707 5.1838 6.9151 5.8351 5.1123 5.5972 3.7741 4.8381 2.1262 1.4277 1.8509 1.6755 4.6427 5.3260 1.6029 1.9962 1.9135 4.0773 1.6317 1.7763 2.1723 2.2109 3.4178 1.4649 1.4052 1.4320 1.3625 5.0670 2.3823 3.6470 2.0533 1.5417 1.3605 1.3199 1.1161 1.2838 1.6517 1.3367 2.1308 1.1515 1.6543 1.8264 2.6740 2.5537 3.8063 2.1573 3.5983 4.7696 3.6088 2.7928 3.4065 4.3460 4.1646 1.2284 2.9054 4.6280 4.1226 5.6445 7.2764 5.8428 6.9089 6.3619 7.2935 1.0578 1.0918 1.0862 1.0864 1.0882 1.0916 1.0889 1.1060 1.0950 1.0948 1.0990 1.0978 1.0956
irintensity: 0.5435 1.2752 1.0776 0.7548 2.3504 0.5773 1.8854 1.5704 0.7009 4.9493 0.2248 1.3693 3.0179 0.4205 2.8383 14.3804 4.5101 1.7382 1.1304 5.8059 13.9702 18.8696 12.5400 2.1877 1.0376 11.7878 5.2743 41.0619 6.4437 1.4235 1.4300 0.4362 67.0797 39.2059 19.5324 2.7601 1.0115 34.3707 0.0253 5.0622 4.4853 25.7812 2.4879 30.7858 3.6460 4.0533 7.0195 3.0121 1.8270 1.1391 1.2700 10.9369 8.6297 4.0355 0.4294 5.7628 0.7936 0.2303 4.7672 11.7201 19.6464 6.2773 29.2705 6.7410 8.5614 0.6470 3.2582 1.8322 6.1286 3.5219 0.1103 3.3397 4.6653 1.5232 1.7006 4.2636 15.4523 9.5681 2.2798 3.1025 6.5584 7.5378 4.7688 0.7670 1.5159 0.8336 21.2349 10.4696 1.5423 1.3126 2.4037 14.8966 12.0608 10.1614 1.4686 17.3568 40.2615 29.2236 45.6352
temp: 298.150 k
press: 1.00000 atm
elementType: 17 6 6 6 6 6 6 6 6 6 6 6 6 6 6 6 6 6 6 6 6 6 1 1 1 1 1 1 1 1 1 1 1 1 1
symmnumber: 1
zpe: 707244.4 jmol-1
zpe.correction: 0.269375 hartree
zpe.thermalcorrener: 0.285027 hartree
zpe.thermalcorrenthalpy: 0.285971 hartree
zpe.thermalcorrgfe: 0.226186 hartree
zpe.sumelectzpe: -1266.708243 hartree
zpe.sumelectthermal: -1266.692591 hartree
zpe.sumelectthermalent: -1266.691647 hartree
zpe.sumelectthermalfe: -1266.751432 hartree
dipole: 0.8296 -2.0296 -1.6032
dipole: 2.7162
quadrupole: -110.7007 -125.2252 -140.9773
quadrupole: 2.8217 0.0120 -10.1556
quadrupole: 14.9337 0.4092 -15.3429 2.8217 0.0120 -10.1556
hfenergy: -1266.9776179 hartree
pointgroup: C01 [X(C21H13Cl1)]
dipole: 0.282779 0.7838489 0.6690585 debye
polarizability: 430.9949134|20.2006148|287.727818|5.5488229|-3.391022|100.9651295 unknown
InChI: InChI=1S/C21H13Cl/c22-12-16-10-15-6-3-5-13-8-9-18-17-7-2-1-4-14(17)11-19(16)21(18)20(13)15/h1-11H,12H2
charge 0 multiplicity 1
35 atoms
Cl -0.120752 -4.510486 -1.099217
C  0.27681 0.185542 0.065976
C  1.677436 0.521684 0.039911
C  -0.129469 -1.208366 0.188075
C  -0.71162 1.223857 -0.032819
C  2.676204 -0.514812 0.133828
C  -2.124157 0.881801 -0.014389
C  2.098702 1.893893 -0.084339
C  0.904018 -2.24087 0.305263
C  -2.50257 -0.512157 0.089184
C  -1.496947 -1.520734 0.186082
C  2.243108 -1.886887 0.267768
C  -0.258607 2.58894 -0.151619
C  1.088022 2.914619 -0.176791
C  4.050867 -0.169893 0.101623
C  3.490685 2.201362 -0.113699
C  -3.170737 1.857373 -0.101163
C  0.54247 -3.678036 0.511351
C  -3.892733 -0.870434 0.093068
C  4.453815 1.180322 -0.02266
C  -4.517577 1.482726 -0.090975
C  -4.885666 0.104569 0.005226
H  -1.822437 -2.564686 0.234479
H  3.012616 -2.665201 0.345847
H  -0.994238 3.394249 -0.227196
H  1.402188 3.960549 -0.270383
H  4.804113 -0.963028 0.173045
H  3.803117 3.247603 -0.210093
H  -2.923674 2.920231 -0.178081
H  -0.275917 -3.833824 1.228888
H  1.412522 -4.292229 0.779079
H  -4.160481 -1.930976 0.16602
H  5.519781 1.429875 -0.048012
H  -5.297765 2.248793 -0.15863
H  -5.943728 -0.178167 0.008952
