program: Gaussian 09
title: 000005529
version: EM64L-G09RevD.01
frameworkgroup: C1[X(C15H21N5O5)]
method: RPBEPBE
basis: SDD
operation: Freq
keyword: #p
keyword: freq=noraman
keyword: PBEPBE/SDD
title: #p freq=noraman PBEPBE/SDD
converged: YES YES NO NO
title: Mulliken charges:
elementType: O O O O O N N N N N C C C C C C C C C C C C C C C H H H H H H H H H H H H H H H H H H H H H
charge: -0.225089 -0.423318 -0.442446 -0.458168 -0.439407 -0.187000 -0.074204 -0.131874 -0.350714 -0.072418 -0.166839 -0.150917 -0.174645 -0.111972 -0.355570 0.214651 -0.225268 -0.137537 0.203844 -0.334841 -0.435828 -0.304656 0.344292 -0.444115 -0.785809 0.255955 0.303704 0.261682 0.247090 0.227266 0.220605 0.366355 0.352907 0.265679 0.399040 0.251312 0.328907 0.223295 0.268869 0.239849 0.205755 0.213258 0.227546 0.251430 0.222050 0.337292
chargesum: 0.00000
title: Mulliken charges with hydrogens summed into heavy atoms:
elementType: O O O O O N N N N N C C C C C C C C C C C C C C C
charge: -0.225089 -0.056963 -0.089539 -0.059128 -0.102115 -0.187000 -0.074204 -0.131874 -0.021807 -0.072418 0.089116 0.152788 0.087037 0.135118 0.092301 0.214651 0.040411 -0.137537 0.203844 -0.083529 0.056336 -0.064807 0.344292 -0.025103 -0.084782
polarizability: 3.32925724e+02 -9.04827412e-02 2.00073352e+02 1.88393668e+01 -9.48334296e+00 1.49434365e+02
1716.lowfreq: -9.5806 -3.4600 -0.0011 -0.0009 -0.0005 0.6371 7.2050 19.7890 20.6912
frequency: 7.0716 19.6719 20.1863 33.7527 37.6857 67.7888 75.0949 104.0474 119.2337 124.4965 147.6211 164.6326 177.8558 182.2711 187.9433 202.9131 221.7001 238.4354 258.4288 263.5117 282.5151 297.5106 303.4612 319.1461 334.6588 345.6810 377.8445 398.2727 412.3398 418.5257 469.1748 482.7936 486.9955 514.7162 523.3789 549.7265 576.0306 586.9958 631.9369 638.4168 651.1812 662.2615 720.6625 725.8993 742.0415 775.5782 783.1416 784.7473 801.6297 808.8070 814.4069 861.1376 873.0157 873.6675 913.7748 923.2601 931.3151 947.5640 950.2337 977.0440 978.2976 983.9127 1002.8172 1017.0940 1019.4950 1030.2212 1041.0372 1055.4675 1067.6305 1069.4927 1102.6053 1124.2865 1151.1409 1163.4176 1168.2626 1184.1638 1195.0175 1204.1657 1208.8286 1226.7394 1253.1826 1255.9911 1265.5977 1289.5270 1291.5814 1301.4897 1301.7152 1315.6812 1322.6981 1324.5751 1333.1124 1360.5199 1362.2996 1366.1169 1368.8115 1373.5991 1378.3803 1380.4410 1398.1095 1432.9113 1441.0950 1455.6828 1463.4685 1463.6481 1466.8459 1473.5778 1482.1984 1491.0340 1532.8004 1613.1521 1683.9955 2970.8469 2973.6766 3001.4862 3002.7481 3013.7501 3039.9830 3051.9157 3053.4303 3057.4896 3058.6352 3074.6827 3087.5309 3098.0336 3100.0191 3108.6195 3166.8943 3235.5341 3529.7882 3540.4549 3551.7237 3574.3282
redmass: 4.6036 6.0655 3.6479 5.7561 5.7657 5.9546 4.0658 4.2356 3.6419 1.1926 4.8769 5.0131 4.7187 4.8155 4.1509 5.9749 5.6895 4.2209 4.2689 5.6289 1.5052 3.3569 2.0956 3.0879 5.6683 2.5011 2.2187 1.4740 2.0060 2.5182 3.4788 3.2931 3.5523 6.2406 4.2533 3.3951 4.0369 4.3784 1.4303 3.9124 6.0410 5.0924 4.7494 5.3615 3.2084 4.6602 3.1614 2.5120 3.4764 1.4009 2.1114 4.8845 2.5169 2.1011 2.8838 2.3398 1.4384 4.0637 2.2777 3.1580 2.5779 2.3307 4.4882 1.9705 4.9533 4.3003 1.4676 3.5473 3.3053 2.6664 2.4628 3.3256 3.0426 1.2704 1.2349 2.1950 1.7122 1.8605 1.3994 1.2083 1.8266 1.5339 1.5921 1.3868 1.5225 1.5547 2.7707 1.7139 1.3816 1.2935 2.4761 1.2807 1.2820 1.3139 1.4762 2.0691 1.4682 1.5097 1.2865 2.6934 2.1106 1.0623 1.0735 1.0868 1.1070 1.2056 1.0903 3.2023 6.5698 6.0493 6.7039 1.0623 1.0424 1.0588 1.0587 1.0859 1.0865 1.0936 1.0913 1.1012 1.0989 1.0994 1.0903 1.0876 1.0980 1.0714 1.0924 1.0979 1.0657 1.0773 1.0662 1.0665
irintensity: 0.2307 0.8054 0.6177 0.4531 0.9510 1.4253 3.0809 0.3588 4.9130 0.5310 7.1078 2.3735 2.7767 1.6883 3.7933 3.7711 1.4685 2.2942 2.8156 21.4841 62.3346 46.5831 12.2703 74.1033 4.2451 22.7422 59.6223 95.7088 123.0721 9.8099 13.0232 13.5859 9.7892 16.3568 4.2216 9.0188 8.4466 23.8744 106.6244 7.1199 35.9809 21.9082 4.2715 29.4602 8.7188 16.2616 18.2586 21.4806 157.8015 53.5265 57.1345 1.1828 30.1988 26.4485 28.7723 51.1075 8.1217 2.7299 49.0921 39.2195 43.9725 22.9671 56.1290 62.0815 80.4425 91.3318 2.8101 9.0856 61.4731 1.4871 5.5946 4.3715 14.1736 37.7976 15.2181 120.2468 18.9582 6.7912 99.3798 11.7154 70.1091 47.2540 4.7734 2.7099 1.7440 47.7475 37.8217 29.2468 4.1731 21.8707 148.3538 8.5905 12.2006 32.4977 23.7786 40.0708 1.0866 15.4541 27.7480 29.7659 49.7591 8.0255 28.7219 6.3242 19.8261 86.1024 28.7960 12.9306 104.2496 799.9360 4.7914 58.8169 15.9705 51.4395 51.5411 31.1904 16.5675 12.1564 8.2959 5.8284 32.0447 213.3541 17.7099 11.6805 34.7598 567.8422 17.5780 0.0616 17.2031 66.0988 6.9966 9.5838
temp: 298.150 k
press: 1.00000 atm
elementType: 8 8 8 8 8 7 7 7 7 7 6 6 6 6 6 6 6 6 6 6 6 6 6 6 6 1 1 1 1 1 1 1 1 1 1 1 1 1 1 1 1 1 1 1 1 1
symmnumber: 1
zpe: 954951.0 jmol-1
zpe.correction: 0.363722 hartree
zpe.thermalcorrener: 0.388161 hartree
zpe.thermalcorrenthalpy: 0.389105 hartree
zpe.thermalcorrgfe: 0.306060 hartree
zpe.sumelectzpe: -1232.119061 hartree
zpe.sumelectthermal: -1232.094622 hartree
zpe.sumelectthermalent: -1232.093678 hartree
zpe.sumelectthermalfe: -1232.176723 hartree
dipole: -1.5027 -4.1460 1.7562
dipole: 4.7468
quadrupole: -149.8296 -158.5366 -141.8804
quadrupole: 16.8942 -3.1255 -3.4696
quadrupole: 0.2526 -8.4544 8.2018 16.8942 -3.1255 -3.4696
hfenergy: -1232.4827829 hartree
pointgroup: C01 [X(C15H21N5O5)]
dipole: 0.4846952 1.5929959 0.8456294 debye
polarizability: 331.6851329|11.4938945|198.6513904|-21.0360257|12.8280587|152.0969178 unknown
InChI: InChI=1S/C15H21N5O5/c1-8(4-21)2-3-16-13-10-14(18-6-17-13)20(7-19-10)15-12(24)11(23)9(5-22)25-15/h2,6-7,9,11-12,15-16,21-24H,3-5H2,1H3
charge 0 multiplicity 1
46 atoms
O  3.947985 -0.039099 -1.213499
O  5.35863 2.546451 -0.808264
O  4.029467 0.641517 2.119582
O  3.580953 -2.646538 -0.333204
O  -8.270001 -0.461713 -0.884038
N  1.928149 1.057071 -0.366825
N  -0.088276 1.784991 0.472166
N  1.239863 -1.307441 -0.9386
N  -2.505208 -0.069443 0.601476
N  -1.117414 -1.733417 -0.384638
C  4.293253 1.945887 -0.005149
C  3.294838 1.219359 -0.94844
C  4.835002 0.795043 0.901741
C  4.690999 -0.486803 0.031601
C  3.94496 -1.67718 0.682714
C  1.041964 -0.0336 -0.470457
C  1.184178 2.111762 0.195612
C  -0.188273 0.446503 0.060312
C  -1.294428 -0.456921 0.09753
C  0.113386 -2.079288 -0.8573
C  -3.693057 -0.944062 0.670977
C  -4.841098 -0.384895 -0.144386
C  -6.10173 -0.08956 0.289463
C  -7.118319 0.452886 -0.704849
C  -6.624307 -0.264998 1.702464
H  3.874152 2.778401 0.579222
H  3.207527 1.740986 -1.91848
H  5.892875 1.00784 1.148435
H  5.660257 -0.837995 -0.36021
H  3.06751 -1.314959 1.249418
H  4.625001 -2.180365 1.392219
H  5.695644 1.867364 -1.450521
H  4.269662 1.356568 2.760491
H  1.615209 3.094799 0.369039
H  2.80065 -2.229434 -0.831912
H  0.216436 -3.108806 -1.212665
H  -2.580593 0.899554 0.920494
H  -3.981244 -1.090073 1.727828
H  -3.368819 -1.922031 0.27057
H  -4.59655 -0.20704 -1.203054
H  -6.633272 0.670791 -1.678626
H  -7.588716 1.378094 -0.327102
H  -6.833387 0.721796 2.161707
H  -7.58644 -0.808995 1.677268
H  -5.933491 -0.810758 2.364814
H  -7.927029 -1.327048 -1.225528
