program: Gaussian 09
title: 000005527
version: EM64L-G09RevD.01
frameworkgroup: C1[X(C18H17NO5)]
method: RPBEPBE
basis: SDD
operation: Freq
keyword: #p
keyword: freq=noraman
keyword: PBEPBE/SDD
title: #p freq=noraman PBEPBE/SDD
converged: YES YES NO NO
title: Mulliken charges:
elementType: O O O O O N C C C C C C C C C C C C C C C C C C H H H H H H H H H H H H H H H H H
charge: -0.304915 -0.292953 -0.270953 -0.431486 -0.320221 -0.492518 0.553190 0.354609 0.210989 -0.507442 0.188414 -0.414052 0.035169 -0.350509 -0.253060 -0.335463 -0.389831 -0.298167 0.189459 -0.213948 -0.246732 0.155520 -0.529967 -0.529614 0.252727 0.241869 0.253988 0.269249 0.373256 0.319331 0.223947 0.275702 0.233291 0.234981 0.250985 0.226214 0.232923 0.258721 0.226761 0.232131 0.388407
chargesum: 0.00000
title: Mulliken charges with hydrogens summed into heavy atoms:
elementType: O O O O O N C C C C C C C C C C C C C C C C C C
charge: -0.304915 -0.292953 -0.270953 -0.043079 -0.320221 -0.119262 0.553190 0.354609 0.210989 -0.254715 0.188414 -0.172183 0.035169 -0.096522 0.016189 -0.016132 -0.165884 -0.022465 0.189459 0.019343 -0.011751 0.155520 0.180154 0.187999
polarizability: 4.91266561e+02 3.87170287e+00 2.48363431e+02 -5.15184890e+00 -3.07212808e+00 1.00859082e+02
1716.lowfreq: -7.0240 -0.0003 0.0005 0.0008 3.9249 4.2748 13.1575 22.6899 31.3960
frequency: 12.0017 22.4063 31.3870 51.5023 66.7363 84.6347 107.4602 113.0530 116.2621 122.2784 142.2952 148.2487 165.3937 168.0584 179.0205 186.3045 241.5712 248.6982 263.6480 280.0342 296.9129 315.0838 347.9872 371.1510 410.6459 420.8767 421.6534 476.5250 482.0588 506.4687 523.8041 529.4110 569.0465 579.8993 596.9279 605.7933 625.1362 686.8497 695.2053 702.1440 712.2428 746.8044 753.4591 762.4973 789.2304 794.7960 835.1747 839.5926 868.4866 896.7923 905.6684 906.7363 909.9125 944.4381 959.7476 974.7209 982.5686 988.4908 1011.1209 1011.9503 1014.8117 1040.7310 1094.2377 1110.6093 1112.1541 1113.3023 1141.1019 1153.4868 1155.2423 1161.9133 1168.2397 1178.7056 1204.1219 1240.6209 1247.6137 1253.6924 1296.5858 1312.9502 1323.7905 1341.6078 1368.3898 1388.6661 1410.6685 1423.9928 1439.1583 1443.3787 1457.3248 1459.7437 1460.4510 1475.8560 1486.2084 1487.3052 1517.3102 1558.8474 1568.1693 1584.1107 1603.2352 1612.3237 1641.5900 1656.0653 2972.6584 2978.1283 3068.4253 3076.6356 3099.6599 3116.9444 3123.4503 3127.0096 3136.7811 3137.7542 3156.9126 3159.0493 3166.8981 3181.9504 3192.7156 3267.9357 3531.5557
redmass: 4.8772 5.4527 6.0873 4.5963 7.2486 4.3640 3.3230 4.0971 5.7388 3.6553 2.9410 1.3078 4.5881 1.2266 3.5287 3.0331 6.1968 4.8414 6.8616 3.7961 4.7647 9.2807 4.4955 7.5158 7.1654 3.5140 3.5496 4.2074 4.7268 5.9265 6.0214 3.2613 5.4702 1.1988 5.2501 5.4777 3.7450 4.4065 6.3037 5.1673 5.6255 5.1095 3.4536 2.6103 1.6921 5.3617 1.5451 5.5640 1.4796 2.5948 1.4245 2.2132 1.4054 7.7285 1.3776 5.6654 1.3646 3.3084 1.2250 1.3074 5.4846 2.1673 2.7168 1.7091 1.3461 1.2544 1.5973 1.3222 1.6190 1.5967 2.1865 1.1644 1.6539 2.4255 1.7044 1.3794 1.8326 2.4523 2.2167 2.0676 4.7676 8.9695 2.1502 1.1821 2.5424 1.5809 1.0559 1.8364 1.3412 1.0686 2.7734 1.0559 2.8936 6.9609 8.3587 7.0583 4.3463 5.8462 3.7673 3.2829 1.0306 1.0309 1.1046 1.1040 1.0906 1.0902 1.1025 1.1032 1.0891 1.0876 1.0912 1.0923 1.0960 1.0965 1.0956 1.0813 1.0641
irintensity: 0.1796 1.0519 0.3615 0.1188 0.0832 4.0530 7.8409 6.6734 3.7487 0.1824 0.1949 0.4768 0.9838 0.3461 2.4326 8.5590 13.1995 7.2671 1.1414 4.1916 1.4162 1.5286 0.4002 4.4916 6.1240 13.4925 3.9367 6.2092 36.0145 21.8687 27.4008 9.7132 10.5740 112.7349 6.7684 46.1573 8.5656 50.8495 5.4559 4.1990 5.9935 1.2654 5.6317 33.1205 43.0932 10.9790 35.5302 4.6403 8.7865 6.2435 3.0744 54.6989 73.3592 79.9852 10.1639 28.5196 3.4568 40.4011 41.1027 16.7686 276.3681 31.5213 134.4147 194.2738 47.7229 2.0143 3.5012 12.5671 67.1621 175.5833 212.5572 29.2315 9.9760 360.3027 14.5139 11.4881 161.6682 15.5415 150.3506 231.3333 109.8617 49.9301 24.0334 3.5478 61.5566 55.3985 14.7871 44.5774 7.3514 13.6275 199.5313 42.9133 591.9717 42.1896 198.8257 206.6123 414.5620 75.3488 81.1088 33.4751 71.5606 93.3345 27.6234 22.4450 0.3100 11.7213 22.6711 26.2561 7.1104 7.9052 3.7993 16.8622 9.5422 7.6048 18.9308 200.8638 65.4935
temp: 298.150 k
press: 1.00000 atm
elementType: 8 8 8 8 8 7 6 6 6 6 6 6 6 6 6 6 6 6 6 6 6 6 6 6 1 1 1 1 1 1 1 1 1 1 1 1 1 1 1 1 1
symmnumber: 1
zpe: 823699.4 jmol-1
zpe.correction: 0.313731 hartree
zpe.thermalcorrener: 0.336474 hartree
zpe.thermalcorrenthalpy: 0.337418 hartree
zpe.thermalcorrgfe: 0.259054 hartree
zpe.sumelectzpe: -1125.257457 hartree
zpe.sumelectthermal: -1125.234713 hartree
zpe.sumelectthermalent: -1125.233769 hartree
zpe.sumelectthermalfe: -1125.312133 hartree
dipole: 1.2538 2.8959 -0.0380
dipole: 3.1559
quadrupole: -104.1743 -130.0548 -141.9671
quadrupole: 0.2399 -2.6162 2.7760
quadrupole: 21.2244 -4.6560 -16.5684 0.2399 -2.6162 2.7760
hfenergy: -1125.5711872 hartree
pointgroup: C01 [X(C18H17N1O5)]
dipole: -0.4744215 -1.1385529 -0.1421894 debye
polarizability: 491.1340975|8.0321871|245.8124585|-0.1384574|20.1882604|103.5425182 unknown
InChI: InChI=1S/C18H17NO5/c1-23-15-9-7-12(11-16(15)24-2)8-10-17(20)19-14-6-4-3-5-13(14)18(21)22/h3-11,19,21H,1-2H3
charge 0 multiplicity 1
41 atoms
O  -4.598061 -2.054092 -0.193976
O  -6.631531 0.041919 0.070898
O  1.615307 2.448471 0.347556
O  5.058425 -3.031112 -0.700975
O  2.864507 -2.333639 -0.542469
N  2.414322 0.258727 -0.059836
C  -2.477471 1.004322 0.17293
C  3.806266 0.444085 -0.038907
C  -4.253766 -0.692036 -0.020577
C  -2.892762 -0.347943 0.002233
C  -5.252192 0.326431 0.090785
C  -3.484294 1.999636 0.337281
C  4.666564 -0.696504 -0.258933
C  -4.850722 1.665029 0.292642
C  -1.070535 1.413475 0.209608
C  4.404191 1.717412 0.193503
C  0.035662 0.62404 0.047914
C  6.079256 -0.526152 -0.239139
C  1.396934 1.213764 0.128366
C  5.803637 1.849618 0.20709
C  6.652466 0.733661 -0.008371
C  4.100579 -2.033588 -0.501978
C  -5.29187 -2.660643 0.96771
C  -7.134223 -0.60412 -1.167086
H  -2.166077 -1.160614 -0.096967
H  -3.184911 3.043373 0.48596
H  -5.629369 2.42679 0.397413
H  -0.871807 2.480452 0.389631
H  2.130091 -0.72288 -0.237093
H  3.748398 2.573765 0.358397
H  -0.046547 -0.453744 -0.143698
H  6.70692 -1.404883 -0.408604
H  6.239421 2.838627 0.38839
H  7.74034 0.851747 0.004857
H  -6.221076 -2.1120 1.206523
H  -4.622351 -2.664439 1.848361
H  -5.520011 -3.693831 0.66542
H  -6.584023 -1.537003 -1.381405
H  -7.035988 0.094635 -2.018722
H  -8.196955 -0.812832 -0.973239
H  4.586657 -3.892825 -0.856292
