program: Gaussian 09
title: 000042108
version: EM64L-G09RevD.01
frameworkgroup: C1[X(C19H21NO4S)]
method: RPBEPBE
basis: SDD
operation: Freq
keyword: #p
keyword: freq=noraman
keyword: PBEPBE/SDD
title: #p freq=noraman PBEPBE/SDD
converged: YES YES NO NO
title: Mulliken charges:
elementType: S O O O O N C C C C C C C C C C C C C C C C C C C H H H H H H H H H H H H H H H H H H H H H
charge: 0.768180 -0.282134 -0.320162 -0.288467 -0.578516 -0.393672 0.348555 -0.591573 0.273052 0.112502 -0.707440 -0.736043 -0.423698 0.279215 -0.218008 -0.363011 0.349521 -0.296308 0.451180 -0.605269 -0.161786 -0.393850 -0.841212 -0.244837 -0.214174 0.239929 0.235279 0.203607 0.245982 0.237669 0.208798 0.235529 0.232753 0.240317 0.226487 0.248964 0.252342 0.266805 0.244927 0.279597 0.237797 0.318464 0.234563 0.217620 0.238529 0.232000
chargesum: 0.00000
title: Mulliken charges with hydrogens summed into heavy atoms:
elementType: S O O O O N C C C C C C C C C C C C C C C C C C C
charge: 0.768180 -0.282134 -0.320162 -0.288467 -0.578516 -0.393672 0.348555 -0.116365 0.273052 0.112502 -0.020182 -0.058964 -0.183381 0.279215 0.008479 -0.114047 0.349521 -0.296308 0.451180 0.158805 0.117811 -0.156053 -0.070564 -0.006308 0.017826
polarizability: 2.81306986e+02 1.75232372e+01 2.77557309e+02 -2.92843525e+01 2.51675276e+00 1.82785152e+02
1716.lowfreq: -9.9960 -6.4059 -0.0016 -0.0013 -0.0011 2.4009 8.3475 16.1426 36.2600
frequency: 6.6232 13.9811 36.2531 38.7676 49.2731 61.1319 77.8003 109.6028 111.9083 144.2315 152.6255 167.9670 178.8069 185.6989 190.6871 206.5721 208.7724 217.4344 222.9426 237.4726 244.4875 264.1714 279.6757 297.1609 303.9742 324.2047 374.4670 381.6758 385.9343 429.7779 431.5750 454.3302 462.8677 502.0512 504.4019 516.5251 533.8021 538.6055 539.6815 582.9449 594.9287 645.1491 659.1116 677.3988 707.0633 717.0556 729.7584 738.2215 765.8872 775.4919 788.3938 813.9441 833.0576 842.5649 848.3259 877.8460 891.0038 912.0842 936.3243 954.6664 962.2922 965.4429 990.3408 993.9802 996.6563 998.4317 1006.9892 1034.0705 1041.8033 1050.7596 1061.3716 1099.2524 1107.4609 1128.9747 1133.6830 1164.3944 1171.6683 1171.9216 1187.4469 1208.6296 1220.1053 1238.1648 1252.9250 1268.5947 1274.3050 1293.0564 1322.2480 1370.7832 1378.3857 1393.3574 1399.1036 1413.0993 1422.3572 1431.2755 1448.0004 1452.2671 1458.3260 1461.4945 1463.5575 1464.1274 1468.8822 1469.9405 1472.7976 1475.6851 1483.2656 1494.1929 1572.0186 1604.4888 1605.1848 1619.0982 1642.0999 2936.8247 2973.8345 2983.1411 2985.6542 2990.7184 3040.4455 3051.3860 3056.4347 3080.5325 3083.1356 3087.7330 3088.0145 3094.8127 3099.3762 3125.1744 3130.4663 3134.5640 3145.3177 3152.2088 3165.0013 3171.9850
redmass: 5.1044 4.3999 5.1280 4.0009 4.2957 4.0273 3.9433 4.7052 6.4063 1.2333 4.2426 4.7191 2.8485 5.1030 1.1154 2.7137 1.3902 2.4729 4.0865 3.7673 1.4661 4.0516 4.0600 4.6356 2.5557 3.2179 3.4594 3.8330 8.3875 3.9715 3.4473 3.3386 4.0192 4.5539 4.6114 3.7161 4.3734 5.2278 4.3784 6.1580 6.5010 6.8295 5.9986 10.8865 5.4008 3.3022 5.3844 3.1398 1.2248 1.7106 4.8501 4.5040 4.1743 12.3204 6.3068 1.3031 1.4647 1.6737 1.3751 1.3543 1.3770 1.7436 2.5310 2.6240 2.0335 1.7368 1.4477 5.6156 2.0633 2.0454 1.5276 1.4900 1.2679 1.8492 1.4710 1.2366 1.0875 1.6330 2.8158 2.4842 1.7167 2.2831 2.4529 2.7870 1.5126 2.2968 6.4269 5.9544 1.2533 1.3825 3.8426 1.2709 2.0397 1.2120 1.1007 2.4022 2.4327 1.1200 1.4484 1.6450 1.0683 1.1502 1.0986 1.0772 1.0595 1.0771 5.4522 7.6215 7.0371 8.8108 11.0417 1.0412 1.0376 1.0391 1.0560 1.0394 1.0875 1.0996 1.0973 1.0992 1.1033 1.0992 1.0990 1.1005 1.1001 1.0859 1.0893 1.0874 1.0938 1.0919 1.1005 1.0984
irintensity: 0.0504 0.1400 1.3189 0.0523 3.0873 0.9410 1.4555 3.2696 1.3760 0.5933 5.2453 3.8793 0.7216 4.4931 0.2387 1.9905 0.6694 1.8452 6.2083 5.7416 1.3636 4.1995 4.9193 16.8718 1.0323 4.3431 1.8539 11.7409 59.3041 1.2184 5.3853 20.9814 22.3501 0.2290 5.9141 5.5122 9.1933 5.7860 2.5600 2.9778 7.5907 0.3566 9.7494 24.6439 7.6514 6.3839 13.3190 29.1124 60.5595 50.9429 2.9030 21.0452 12.2356 79.3311 41.5905 0.4942 1.4355 1.6296 0.7385 1.3724 0.4929 0.7864 3.3340 12.6553 0.7444 1.6768 0.6667 525.2456 6.8146 72.0056 11.1961 31.4312 4.7584 75.8747 6.7861 27.6684 2.0388 2.9442 20.7946 12.0951 55.9233 39.2051 17.2242 74.5490 5.9572 50.2556 231.7933 5.0777 29.4142 8.2781 25.2660 25.3390 2.2198 52.6981 6.7440 76.1832 19.5063 5.6243 8.2781 66.0772 14.3354 0.7850 34.7431 21.8873 25.6611 18.1265 0.2409 7.1312 3.3071 11.3907 375.8928 12.4671 33.2384 18.7675 16.5633 32.9162 12.2960 12.4704 11.5515 12.2360 18.0295 17.4236 30.3291 14.1483 33.3710 2.1601 6.6692 3.7380 12.6383 17.6671 31.7410 15.5945
temp: 298.150 k
press: 1.00000 atm
elementType: 16 8 8 8 8 7 6 6 6 6 6 6 6 6 6 6 6 6 6 6 6 6 6 6 6 1 1 1 1 1 1 1 1 1 1 1 1 1 1 1 1 1 1 1 1 1
symmnumber: 1
zpe: 939455.3 jmol-1
zpe.correction: 0.357820 hartree
zpe.thermalcorrener: 0.383068 hartree
zpe.thermalcorrenthalpy: 0.384012 hartree
zpe.thermalcorrgfe: 0.300211 hartree
zpe.sumelectzpe: -1488.423249 hartree
zpe.sumelectthermal: -1488.398001 hartree
zpe.sumelectthermalent: -1488.397057 hartree
zpe.sumelectthermalfe: -1488.480858 hartree
dipole: -2.0316 4.7262 -0.7905
dipole: 5.2048
quadrupole: -148.4493 -141.2176 -151.3945
quadrupole: 7.3341 -4.2225 1.7288
quadrupole: -1.4288 5.8029 -4.3740 7.3341 -4.2225 1.7288
hfenergy: -1488.7810687 hartree
pointgroup: C01 [X(C19H21N1O4S1)]
dipole: 1.0448326 1.7605003 0.0455903 debye
polarizability: 269.2970009|-20.494925|281.6263202|-37.6032202|-4.7556329|190.7261261 unknown
InChI: InChI=1S/C19H21NO4S/c1-13-8-5-6-11-16(13)25(22)20(4)18(21)23-15-10-7-9-14-12-19(2,3)24-17(14)15/h5-11H,12H2,1-4H3
charge 0 multiplicity 1
46 atoms
S  -3.107282 -1.386586 -0.270975
O  1.798567 0.614251 0.413744
O  0.802056 -2.151387 0.678408
O  -0.252661 -1.186705 -1.218751
O  -4.2056 -2.040523 0.77142
N  -1.462793 -1.812052 0.682785
C  2.56907 1.831886 -0.124497
C  4.021558 1.295314 -0.371686
C  3.841457 -0.215948 -0.412933
C  2.542948 -0.51196 0.060323
C  1.865759 2.227878 -1.434539
C  2.47029 2.910061 0.957371
C  4.718195 -1.25404 -0.771674
C  2.091471 -1.841409 0.155295
C  4.274335 -2.597688 -0.657747
C  2.96691 -2.887581 -0.200839
C  -0.323637 -1.66069 -0.055189
C  -3.215081 0.480019 0.121173
C  -2.812376 1.439877 -0.842044
C  -1.604991 -2.352711 2.025785
C  -3.769996 0.810374 1.370229
C  -2.960793 2.800632 -0.457067
C  -2.283384 1.075287 -2.216457
C  -3.90114 2.170859 1.719914
C  -3.486458 3.16459 0.802606
H  4.697339 1.590912 0.454278
H  4.438755 1.702688 -1.30977
H  2.340627 3.125803 -1.872245
H  1.919285 1.404536 -2.168347
H  0.801296 2.446781 -1.241951
H  3.004759 3.823027 0.636466
H  1.414766 3.172023 1.146237
H  2.915264 2.556158 1.903186
H  5.729082 -1.034505 -1.132223
H  4.942042 -3.420342 -0.932882
H  2.609893 -3.919245 -0.122317
H  -1.105516 -3.333146 2.109748
H  -2.693399 -2.49489 2.204173
H  -1.19397 -1.661797 2.782922
H  -4.11689 0.006748 2.0310
H  -2.665431 3.579544 -1.169897
H  -1.431769 0.374996 -2.146843
H  -3.065792 0.587781 -2.829342
H  -1.955768 1.979455 -2.756698
H  -4.326622 2.450235 2.689298
H  -3.585274 4.224486 1.062549
