program: Gaussian 09
title: 000005491
version: EM64L-G09RevD.01
frameworkgroup: C1[X(C18H20O4)]
method: RPBEPBE
basis: SDD
operation: Freq
keyword: #pfreq=noraman
keyword: PBEPBE/SDD
title: #p freq=noraman PBEPBE/SDD
converged: YES YES NO NO
title: Mulliken charges:
elementType: O O O O C C C C C C C C C C C C C C C C C C H H H H H H H H H H H H H H H H H H H H
charge: -0.302087 -0.273679 -0.276651 -0.260134 0.377907 0.586723 0.153106 -0.315260 -0.358206 -0.580674 -0.587772 -0.371233 0.356353 0.346256 -0.516479 0.340378 -0.522932 -0.387796 -0.526698 -0.535377 -0.536083 -0.535584 0.245831 0.220063 0.241615 0.252114 0.234584 0.261257 0.265601 0.250363 0.219984 0.236419 0.231103 0.222079 0.243253 0.222485 0.224242 0.219689 0.242724 0.246506 0.220634 0.225376
chargesum: 0.00000
title: Mulliken charges with hydrogens summed into heavy atoms:
elementType: O O O O C C C C C C C C C C C C C C C C C C
charge: -0.302087 -0.273679 -0.276651 -0.260134 0.377907 0.586723 0.153106 -0.069429 -0.138143 -0.339059 -0.335658 -0.136648 0.356353 0.346256 -0.255223 0.340378 -0.257331 -0.137434 0.160808 0.152440 0.150572 0.156932
polarizability: 4.47506301e+02 6.64204919e+00 2.25013095e+02 -6.05767690e+00 6.51055286e-01 1.12765858e+02
1716.lowfreq: -9.5393 -6.0119 -0.0006 -0.0002 0.0009 1.9781 15.2008 29.5796 38.1337
frequency: 14.4608 29.5523 38.0897 55.6443 67.2500 86.6969 100.1378 119.5154 124.5134 142.5367 157.4178 165.1334 189.0222 192.4805 196.1047 197.8497 214.7996 236.8027 258.5942 265.2259 273.1162 280.3355 307.3101 368.5837 379.6080 401.9219 422.3041 455.0451 474.8133 490.0316 507.7531 519.8771 565.5834 596.8010 601.5625 606.7304 637.7879 661.9228 686.8799 690.4971 742.9164 817.0354 819.9022 829.6032 841.5637 854.3501 861.6984 878.7367 881.5701 900.9216 947.7351 956.3907 968.5603 976.9029 986.7921 1000.9226 1027.2386 1041.3775 1079.1509 1111.2662 1111.9095 1112.0288 1113.3104 1137.4855 1147.5192 1153.3339 1154.4149 1159.3012 1161.8544 1164.6765 1195.5595 1256.3189 1263.7162 1277.6442 1279.3271 1313.0626 1315.7723 1376.2223 1407.9398 1413.2817 1424.4099 1431.7867 1438.8843 1446.4443 1450.2497 1458.3633 1462.7317 1463.8944 1464.2477 1466.5413 1472.3468 1473.9942 1474.7327 1477.5444 1492.2303 1565.1521 1593.1118 1604.5981 1617.3299 1640.3551 2956.0989 2958.1782 2958.6739 2961.1045 3044.1479 3045.3837 3046.0889 3049.4543 3092.9285 3113.3419 3115.0087 3122.3044 3124.1088 3127.1275 3141.8673 3154.0641 3169.7534 3170.6005 3172.5691 3180.8952
redmass: 4.5868 4.3855 4.8451 2.7709 3.6704 3.2215 3.5978 3.8520 3.9005 3.6546 2.1768 1.4757 2.1168 1.6778 2.8741 1.7056 3.3332 1.3700 2.1054 1.9469 2.5293 3.7267 3.5517 4.7508 4.5233 5.0502 4.9297 5.4895 3.6345 4.5662 5.1065 5.3105 5.1441 4.0273 4.0589 3.9671 4.0933 5.6642 1.6848 6.2892 2.7506 2.3200 1.4992 1.9973 1.6181 2.0314 1.7593 6.3473 5.5355 2.2029 4.4696 1.4587 7.7222 5.6347 1.1446 3.7258 3.8742 2.9676 2.5016 1.2603 1.2600 1.2428 1.2596 1.6266 1.3470 1.4239 1.4121 1.6893 1.6442 1.6345 1.6646 2.7978 1.9227 1.6275 1.3808 1.3057 5.2930 4.4901 6.2110 3.1625 1.3802 1.2146 1.3868 1.3513 1.8758 1.0563 1.8211 1.0821 1.0546 1.0498 1.1100 1.0613 1.0897 1.2865 2.6631 7.3594 5.7108 6.7126 6.8819 5.5543 1.0314 1.0329 1.0329 1.0329 1.1041 1.1038 1.1039 1.1039 1.0905 1.0990 1.0883 1.0994 1.0994 1.0996 1.0879 1.0917 1.0902 1.0932 1.0938 1.0914
irintensity: 0.4343 1.4988 0.2980 6.0946 0.7872 9.0817 4.2009 1.4157 1.1242 5.1387 0.2917 0.4534 1.1465 2.4469 3.1279 0.6905 9.2776 0.6759 2.2472 0.6032 0.5640 4.3552 1.8348 1.9022 0.4381 7.0195 3.1870 6.7487 7.2485 5.0701 25.4174 6.1732 27.4637 1.2811 0.0675 6.4414 3.2622 0.4343 28.1187 1.7735 0.4454 15.8076 9.8818 10.1969 5.7088 68.5305 19.4849 2.8116 18.1874 18.2666 2.7012 1.5749 57.0391 3.7738 58.8132 66.6707 77.9154 88.7212 71.6719 0.0977 0.3289 0.5992 0.2025 117.0756 4.6805 12.1334 18.5479 36.1646 63.9806 98.6778 119.2167 17.4460 223.6096 35.9890 58.6485 1.4545 143.7591 15.3800 15.7050 13.0482 44.8834 23.9216 2.9449 13.3715 62.8781 12.7327 24.5309 13.7921 14.1115 13.6592 73.0592 25.8796 18.7310 38.7215 88.1579 32.9610 230.8117 412.5414 36.8520 9.5733 57.3120 49.9419 78.6212 91.0693 45.4808 32.0480 61.2288 47.8751 12.6692 40.4424 24.5151 30.7738 28.6284 27.0767 6.8747 4.3795 4.5598 7.8810 9.7624 1.5320
temp: 298.150 k
press: 1.00000 atm
elementType: 8 8 8 8 6 6 6 6 6 6 6 6 6 6 6 6 6 6 6 6 6 6 1 1 1 1 1 1 1 1 1 1 1 1 1 1 1 1 1 1 1 1
symmnumber: 1
zpe: 881900.5 jmol-1
zpe.correction: 0.335898 hartree
zpe.thermalcorrener: 0.358421 hartree
zpe.thermalcorrenthalpy: 0.359365 hartree
zpe.thermalcorrgfe: 0.282538 hartree
zpe.sumelectzpe: -997.123211 hartree
zpe.sumelectthermal: -997.100689 hartree
zpe.sumelectthermalent: -997.099744 hartree
zpe.sumelectthermalfe: -997.176572 hartree
dipole: 1.0609 2.2696 1.4098
dipole: 2.8747
quadrupole: -97.5544 -121.4045 -132.4588
quadrupole: 7.3628 4.4668 2.5945
quadrupole: 19.5848 -4.2652 -15.3195 7.3628 4.4668 2.5945
hfenergy: -997.4591096 hartree
pointgroup: C01 [X(C18H20O4)]
dipole: -0.4184726 0.9007062 -0.5410947 debye
polarizability: 447.6697059|-5.0429904|224.91845|-3.1024609|1.4436811|112.6970982 unknown
InChI: InChI=1S/C18H20O4/c1-19-15-8-7-14(18(12-15)22-4)6-5-13-9-16(20-2)11-17(10-13)21-3/h5-12H,1-4H3
charge 0 multiplicity 1
42 atoms
O  -2.629809 2.140436 -0.318889
O  5.049993 -2.232653 -0.446627
O  4.297861 2.449046 0.598483
O  -6.175512 -1.217978 0.220162
C  -2.029092 -0.223264 0.07064
C  1.88023 -0.3888 0.024992
C  -3.019076 0.786768 -0.117335
C  -0.605568 0.135339 0.078208
C  0.449559 -0.73469 -0.022839
C  2.344281 0.934186 0.30603
C  2.82552 -1.41487 -0.215899
C  -2.509166 -1.550943 0.290475
C  4.21414 -1.134303 -0.188576
C  3.728052 1.191514 0.330212
C  -4.402129 0.509475 -0.078361
C  -4.834035 -0.818393 0.147672
C  4.680917 0.167506 0.08237
C  -3.877158 -1.853012 0.324801
C  -2.279585 2.461034 -1.71697
C  6.495278 -1.998605 -0.426831
C  3.38564 3.558301 0.881173
C  -7.199116 -0.180069 0.07191
H  -0.410974 1.211133 0.178372
H  0.24186 -1.803961 -0.172329
H  1.62451 1.728972 0.515669
H  2.502206 -2.43826 -0.431646
H  -1.788332 -2.355904 0.468917
H  -5.099226 1.340732 -0.214642
H  5.741424 0.427273 0.117423
H  -4.233901 -2.87093 0.506833
H  -3.149302 2.300415 -2.383924
H  -1.430758 1.843056 -2.068838
H  -1.997721 3.525362 -1.71868
H  6.794357 -1.261897 -1.197908
H  6.947932 -2.97573 -0.650762
H  6.832919 -1.648687 0.568279
H  2.77212 3.356676 1.780848
H  2.720676 3.763424 0.019352
H  4.036193 4.42662 1.062448
H  -8.159303 -0.706277 0.174265
H  -7.141261 0.301889 -0.923572
H  -7.107544 0.589868 0.862395
