program: Gaussian 09
title: 000042064
version: EM64L-G09RevD.01
frameworkgroup: C1[X(C20H16)]
method: RPBEPBE
basis: SDD
operation: Freq
keyword: #p
keyword: freq=noraman
keyword: PBEPBE/SDD
title: #p freq=noraman PBEPBE/SDD
converged: YES YES NO NO
title: Mulliken charges:
elementType: C C C C C C C C C C C C C C C C C C C C H H H H H H H H H H H H H H H H
charge: 0.243944 0.221748 0.485033 0.479437 0.193800 0.374897 -0.699893 -0.678150 0.417176 -0.515637 -0.551178 -0.487064 -0.475449 -0.449015 -0.367519 -0.247180 -0.434982 -0.686609 -0.259721 -0.250634 0.248108 0.230418 0.241860 0.220920 0.211813 0.244623 0.233827 0.233060 0.224287 0.225933 0.239120 0.234565 0.216774 0.225375 0.227326 0.228985
chargesum: 0.00000
title: Mulliken charges with hydrogens summed into heavy atoms:
elementType: C C C C C C C C C C C C C C C C C C C C
charge: 0.243944 0.221748 0.485033 0.479437 0.193800 0.374897 -0.451785 -0.447732 0.417176 -0.273777 -0.118444 -0.242440 -0.241622 -0.215955 -0.143232 -0.021247 -0.195861 -0.009895 -0.032395 -0.021649
polarizability: 4.07573614e+02 -1.52905843e+01 2.36246240e+02 7.23093677e+00 7.81498544e+00 9.36319590e+01
1716.lowfreq: -7.4506 -4.4302 -1.3373 -0.0003 0.0003 0.0004 42.3063 65.5038 84.7347
frequency: 42.2820 65.4983 84.7340 119.2614 147.4944 150.9233 187.0110 204.9471 246.6199 266.5815 288.8775 334.6185 352.6467 404.4300 408.7756 429.6784 439.8394 498.0080 514.5584 519.7481 534.6720 539.2197 570.4665 575.6947 617.2901 645.3001 705.8070 711.3053 728.5257 756.6096 757.6614 766.2993 785.3608 802.6836 817.6825 828.7135 848.8181 869.8312 885.6454 899.9214 914.0167 924.3101 936.0184 956.6788 969.5056 980.4514 982.9380 991.6394 1016.2198 1040.6671 1059.3476 1074.8003 1095.6421 1109.0929 1155.7776 1174.3808 1177.7246 1211.5357 1213.9427 1231.6261 1240.8923 1250.8527 1272.6668 1289.6997 1302.0376 1314.2079 1335.2169 1386.4890 1387.7156 1401.8533 1405.7425 1428.2183 1433.6060 1448.2743 1455.8843 1471.9176 1472.8124 1481.4854 1494.8627 1504.4642 1559.7883 1575.8811 1595.0565 1615.8276 1627.2121 1632.4323 2982.1519 2986.2845 3036.5137 3078.8326 3086.9173 3116.8228 3117.5140 3121.5230 3125.9632 3130.6870 3134.9222 3136.9449 3142.9242 3150.6505 3154.3917 3165.3392
redmass: 4.2074 3.9531 3.1258 3.5954 4.2849 3.3515 3.5056 1.3904 2.4303 3.6739 3.7591 4.3890 5.2458 3.0576 3.0914 3.4449 3.6876 5.4270 4.1606 3.4214 3.8433 4.3045 6.4543 3.0887 3.9739 6.2352 5.2070 3.1228 5.1645 1.3289 4.9458 1.4570 1.2832 1.8625 2.1996 1.6088 3.3283 4.1101 1.5919 1.5420 1.5827 4.2298 1.9494 1.4052 3.0338 1.3733 1.3840 1.3806 2.2660 2.1839 2.2146 2.2492 1.6190 2.1059 1.3477 1.1955 1.0791 1.6060 1.7266 1.7923 1.2895 1.8803 1.7780 1.4633 2.2379 1.5267 3.4819 3.3913 1.3618 1.8734 4.3841 4.3507 3.1331 2.8756 3.4310 1.2379 2.0936 1.0745 1.1032 3.4457 5.7309 7.3494 5.5405 6.0817 6.7682 6.8174 1.0359 1.0601 1.1001 1.0999 1.1008 1.0859 1.0863 1.0863 1.0914 1.0894 1.0894 1.0909 1.0978 1.0930 1.0990 1.0997
irintensity: 0.3227 0.3429 0.3229 0.0382 0.6758 0.5676 1.4051 0.8947 0.9245 0.5471 0.4834 0.8210 0.4291 0.8554 0.0294 10.1263 7.8209 0.3495 1.3968 1.1872 1.2872 1.1561 4.8171 5.3495 0.8740 3.1457 2.8508 9.1925 4.3322 24.7075 3.3752 60.5983 1.9101 0.1058 7.2181 42.6666 3.3154 1.8466 1.0104 37.3910 37.5704 1.5966 1.4090 7.3623 4.3003 3.8622 0.0279 0.0126 5.3230 6.5331 10.8946 7.3639 6.2941 4.2219 1.7089 3.4276 0.6565 7.5998 3.2953 3.9772 0.2539 9.1947 1.3475 0.7380 0.1149 1.6385 1.8448 7.0954 8.9033 5.7826 0.2948 6.4522 5.5415 0.6810 2.8962 13.8655 0.3379 1.7505 17.9795 16.3537 3.4920 5.3086 0.6838 2.7006 1.6801 0.7399 40.6658 37.5717 12.0093 52.9347 41.3393 0.1882 8.0899 3.7112 13.1282 18.5312 5.7403 1.3277 39.2265 28.7454 46.9958 38.5018
temp: 298.150 k
press: 1.00000 atm
elementType: 6 6 6 6 6 6 6 6 6 6 6 6 6 6 6 6 6 6 6 6 1 1 1 1 1 1 1 1 1 1 1 1 1 1 1 1
symmnumber: 1
zpe: 769341.4 jmol-1
zpe.correction: 0.293027 hartree
zpe.thermalcorrener: 0.308313 hartree
zpe.thermalcorrenthalpy: 0.309257 hartree
zpe.thermalcorrgfe: 0.250794 hartree
zpe.sumelectzpe: -770.416686 hartree
zpe.sumelectthermal: -770.401400 hartree
zpe.sumelectthermalent: -770.400456 hartree
zpe.sumelectthermalfe: -770.458919 hartree
dipole: -0.3594 -0.2934 0.0785
dipole: 0.4705
quadrupole: -99.2136 -101.7716 -125.5638
quadrupole: 1.2520 0.7636 2.1675
quadrupole: 9.6361 7.0780 -16.7141 1.2520 0.7636 2.1675
hfenergy: -770.709713 hartree
pointgroup: C01 [X(C20H16)]
dipole: -0.1386074 -0.1183972 0.0321695 debye
polarizability: 408.192205|-11.0759417|235.7832412|7.5482977|6.2471867|93.4763669 unknown
InChI: InChI=1S/C20H16/c1-2-14-7-5-8-16-13-20-17(12-19(14)16)11-10-15-6-3-4-9-18(15)20/h3-13H,2H2,1H3
charge 0 multiplicity 1
36 atoms
C  0.820028 0.23129 -0.0278
C  -2.063335 -0.077026 -0.165651
C  0.206434 -1.082777 -0.153783
C  -1.45007 1.238868 -0.044013
C  2.287642 0.331548 0.03977
C  -3.509745 -0.185415 -0.233521
C  -1.198919 -1.204039 -0.217713
C  -0.033228 1.351753 0.021068
C  3.078222 -0.871711 -0.022742
C  1.050404 -2.260845 -0.213006
C  -4.199576 -1.540533 -0.314557
C  -2.288549 2.405525 0.004385
C  2.423127 -2.160512 -0.150333
C  -4.274726 0.984585 -0.190799
C  2.972613 1.576492 0.165764
C  -3.672442 2.27999 -0.069682
C  4.501551 -0.789417 0.041196
C  -4.284806 -2.259257 1.060922
C  4.37388 1.639007 0.227003
C  5.148547 0.447968 0.164262
H  -1.623503 -2.209306 -0.314948
H  0.384783 2.360398 0.11051
H  0.566576 -3.240079 -0.309503
H  -5.225141 -1.399997 -0.703921
H  -3.681191 -2.199565 -1.037589
H  -1.820097 3.392416 0.097721
H  3.051241 -3.058095 -0.195764
H  -5.367555 0.910445 -0.250175
H  2.404623 2.510479 0.217587
H  -4.311815 3.169039 -0.037809
H  5.085969 -1.716094 -0.007996
H  -3.281176 -2.433447 1.48773
H  -4.791914 -3.236652 0.961509
H  -4.853361 -1.648157 1.784569
H  4.872412 2.609728 0.323843
H  6.241596 0.500295 0.212169
