program: Gaussian 09
title: 000005448
version: EM64L-G09RevD.01
frameworkgroup: C1[X(C4H6N2OS)]
method: RPBEPBE
basis: SDD
operation: Freq
keyword: #p
keyword: freq=noraman
keyword: PBEPBE/SDD
title: #p freq=noraman PBEPBE/SDD
converged: NO YES NO NO
title: Mulliken charges:
elementType: S O N N C C C C H H H H H H
charge: 0.381676 -0.261539 -0.715746 -0.589349 -0.018953 -0.409318 -0.357544 0.281475 0.210507 0.244856 0.304033 0.350284 0.287143 0.292475
chargesum: 0.00000
title: Mulliken charges with hydrogens summed into heavy atoms:
elementType: S O N N C C C C
charge: 0.381676 -0.261539 -0.365462 -0.009731 -0.018953 0.046045 -0.053510 0.281475
polarizability: 9.57910889e+01 -8.25178830e+00 9.07845421e+01 -2.57618684e+00 -6.33694151e-01 3.81764448e+01
1716.lowfreq: -11.6739 -9.1934 0.0022 0.0025 0.0025 7.7161 69.3216 141.8191 180.3197
frequency: 69.2752 141.8122 180.3189 203.7119 205.4868 362.3857 412.1344 423.2252 464.8426 495.4914 518.7685 567.8985 681.7101 683.9194 770.1208 843.2081 911.4487 929.9436 1028.2711 1133.2453 1137.8198 1170.6001 1232.8146 1260.4685 1293.1087 1379.3616 1462.2381 1601.7032 1629.0272 1641.2125 2871.9915 3010.3794 3221.4377 3521.7431 3588.5705 3656.7379
redmass: 2.4072 2.8439 4.9279 2.9076 1.7778 4.1254 2.2421 4.8720 1.3366 1.5843 8.5848 6.7531 4.3241 3.9309 5.3446 1.4057 1.7976 2.1570 5.6780 3.5397 1.2979 1.3925 4.8551 1.4465 1.2198 1.4776 1.0923 5.8324 5.0005 1.2626 1.0718 1.0859 1.0954 1.0450 1.0800 1.1009
irintensity: 1.9090 10.6870 2.7095 7.8388 33.4752 10.6876 39.7617 16.3063 123.5322 216.5366 25.0156 29.8686 1.8770 9.6587 20.7923 42.5117 7.7298 8.1593 14.3657 19.4980 0.4070 17.8903 80.2519 9.7236 4.0729 7.7722 10.6622 42.9754 322.0196 68.1489 77.5013 15.6008 2.2301 5.1862 69.6375 9.3982
temp: 298.150 k
press: 1.00000 atm
elementType: 16 8 7 7 6 6 6 6 1 1 1 1 1 1
symmnumber: 1
zpe: 267403.8 jmol-1
zpe.correction: 0.101849 hartree
zpe.thermalcorrener: 0.110285 hartree
zpe.thermalcorrenthalpy: 0.111230 hartree
zpe.thermalcorrgfe: 0.068393 hartree
zpe.sumelectzpe: -738.176894 hartree
zpe.sumelectthermal: -738.168457 hartree
zpe.sumelectthermalent: -738.167513 hartree
zpe.sumelectthermalfe: -738.210349 hartree
dipole: -4.7485 3.0153 -0.3966
dipole: 5.6390
quadrupole: -48.2968 -57.2336 -54.4047
quadrupole: 11.2130 -0.0094 1.1155
quadrupole: 5.0149 -3.9219 -1.0930 11.2130 -0.0094 1.1155
hfenergy: -738.2787424 hartree
pointgroup: C01 [X(C4H6N2O1S1)]
dipole: -1.9529047 -0.9456995 -0.4622969 debye
dipolederiv: -0.0353551 -0.0310578 -0.033115 0.0328806 -0.4164649 -0.2574483 -0.0101565 -0.2504829 0.0618092 -0.9836551 -0.4184696 -0.2593225 -0.3546679 -0.7036674 -0.1910467 -0.2319267 -0.2043216 -0.4834072 -0.206774 0.3414229 0.1912915 0.0391767 -0.533271 0.0061521 0.0650414 0.039456 -0.5138353 -0.6946133 -0.0759458 0.135977 -0.0047049 -0.7284238 -0.0793305 0.179371 -0.153503 -0.3038296 0.3309332 -0.0717102 0.0677273 -0.1135976 0.6318746 0.3242388 0.1226674 0.3460018 0.0104554 0.4574384 -0.120824 -0.1530476 -0.0466977 0.4653185 0.0364817 -0.2273624 0.1059267 0.2631465 -0.7228024 -0.2694978 -0.1866851 -0.0167001 -0.2092478 -0.024746 -0.1199598 -0.0700528 -0.1978732 1.1675134 0.3970758 0.2914571 0.3056307 0.9071548 0.3261561 0.2637308 0.3408379 0.4358386 -0.0109267 -0.0095093 0.0341551 -0.0458369 -0.2739698 -0.0509984 0.0452129 -0.0100236 0.0613245 -0.0018491 0.0227099 -0.0424782 0.0767996 0.0560964 0.0391268 -0.0328345 0.0106755 -0.0935846 0.1245389 0.0096054 -0.0024656 0.0539316 0.0628768 -0.052607 0.0034887 -0.0559823 0.1719895 0.2127364 -0.0088058 -0.0278573 -0.0684806 0.2016022 -0.0976522 -0.0644528 -0.0881684 0.3581996 0.273886 0.0828297 0.0275547 0.0926024 0.2189397 0.0541391 0.0198739 0.0268555 0.0740245 0.0889293 0.1521765 -0.0431915 0.0496641 0.3211818 -0.0324654 -0.0126933 -0.0372187 0.1557421 unknown
polarizability: 96.2237229|3.9542613|79.6100684|9.6385488|20.2314774|48.9182844 unknown
InChI: InChI=1S/C4H6N2OS/c5-2-3-1-4(7)6-8-3/h1,6H,2,5H2
charge 0 multiplicity 1
14 atoms
S  0.108568 -1.73709 -0.828643
O  2.538599 0.971169 0.67199
N  1.643235 -0.968488 -0.301846
N  -2.847315 0.887747 0.376809
C  -0.752724 -0.21248 -0.286142
C  -2.256325 -0.146566 -0.469543
C  0.105735 0.710234 0.23965
C  1.533404 0.322513 0.254632
H  -2.678393 -1.169613 -0.311383
H  -2.469839 0.109406 -1.526074
H  -0.227657 1.675736 0.61789
H  2.534058 -1.456498 -0.404754
H  -2.865393 0.697887 1.379097
H  -3.678253 1.353543 0.016116
