program: Gaussian 09
title: 000042026
version: EM64L-G09RevD.01
frameworkgroup: C1[X(C9H8Cl2O2)]
method: RPBEPBE
basis: SDD
operation: Freq
keyword: #p
keyword: freq=noraman
keyword: PBEPBE/SDD
title: #p freq=noraman PBEPBE/SDD
converged: YES YES NO NO
title: Mulliken charges:
elementType: Cl Cl O O C C C C C C C C C H H H H H H H H
charge: 0.013183 -0.030038 -0.299019 -0.223020 0.331970 -0.267368 -0.305155 -0.217518 0.200201 -0.205068 -0.216327 -0.085937 -0.673838 0.287368 0.232209 0.232512 0.286707 0.264260 0.215817 0.230563 0.228498
chargesum: 0.00000
title: Mulliken charges with hydrogens summed into heavy atoms:
elementType: Cl Cl O O C C C C C C C C C
charge: 0.013183 -0.030038 -0.299019 -0.223020 0.331970 -0.267368 -0.017787 0.247203 0.200201 0.081639 0.047933 -0.085937 0.001039
polarizability: 1.84731966e+02 9.77045888e+00 1.38903813e+02 -1.08506354e+00 6.39359037e-01 5.62290750e+01
1716.lowfreq: -16.1912 0.0011 0.0014 0.0033 3.0395 9.5096 12.0457 50.7104 62.8044
frequency: -11.4929 50.5601 62.8032 92.0570 130.8587 162.2248 184.4422 207.3528 244.6478 274.1017 287.1638 325.4955 372.1833 380.7725 442.8637 489.1150 526.1784 544.0871 656.1592 660.7501 740.5332 747.2681 796.9518 803.0799 838.1950 850.2244 870.8727 979.6236 1006.5517 1027.9594 1069.5220 1091.7181 1112.2783 1136.5854 1146.5731 1220.8388 1250.0223 1254.9178 1356.3100 1357.3903 1379.1112 1399.7365 1454.3282 1464.3764 1473.2592 1486.4961 1558.0684 1587.8762 1629.7142 2995.7379 3010.7600 3068.9455 3092.5753 3107.0722 3173.0900 3183.8542 3193.0367
redmass: 4.1902 4.1151 4.0218 4.6257 2.8437 5.9932 16.7445 6.7240 1.3063 8.6432 4.9693 9.2713 3.7683 11.0898 3.2012 6.3545 7.2048 6.1795 7.4128 4.5757 9.6374 4.3901 1.1180 4.9943 1.4921 4.2494 1.4088 1.3532 4.5804 2.8620 2.7675 4.5552 2.2202 1.4708 1.3375 3.4689 1.1303 1.3181 2.1205 1.9291 6.5805 1.2668 2.5731 1.0406 1.0592 1.0695 8.9675 7.1271 11.8325 1.0357 1.0582 1.1065 1.0985 1.1027 1.0894 1.0933 1.0966
irintensity: 0.1976 0.8599 0.0098 0.7176 5.4618 0.0270 1.6276 1.5634 0.3462 5.0109 1.6935 5.0117 8.1577 2.6976 5.7110 9.2083 16.2929 1.8634 1.1313 21.9905 33.0122 10.1759 2.6805 27.4511 32.3584 8.1573 19.3669 1.2056 144.2391 166.7958 201.8815 2.6598 2.8496 5.7254 25.2631 297.9667 0.0461 14.0253 10.9960 7.7929 10.2565 23.5378 62.8018 12.7648 6.6881 9.8150 40.0060 137.6960 215.4548 20.4807 18.2989 6.7429 29.7323 44.5951 0.2729 0.7790 1.5246
temp: 298.150 k
press: 1.00000 atm
elementType: 17 17 8 8 6 6 6 6 6 6 6 6 6 1 1 1 1 1 1 1 1
symmnumber: 1
zpe: 388841.8 jmol-1
zpe.correction: 0.148102 hartree
zpe.thermalcorrener: 0.160242 hartree
zpe.thermalcorrenthalpy: 0.161186 hartree
zpe.thermalcorrgfe: 0.108327 hartree
zpe.sumelectzpe: -1417.374651 hartree
zpe.sumelectthermal: -1417.362511 hartree
zpe.sumelectthermalent: -1417.361567 hartree
zpe.sumelectthermalfe: -1417.414426 hartree
dipole: 1.4581 -3.0519 0.1059
dipole: 3.3840
quadrupole: -80.1422 -90.3350 -90.2254
quadrupole: -8.5425 0.3568 0.9272
quadrupole: 6.7587 -3.4342 -3.3245 -8.5425 0.3568 0.9272
hfenergy: -1417.5227533 hartree
pointgroup: C01 [X(C9H8Cl2O2)]
dipole: -0.5719598 -1.1906262 -0.1667513 debye
dipolederiv: -0.0667359 0.0468326 -0.0030776 0.0535691 -0.7197436 -0.0356808 -0.0007443 -0.0272114 -0.0256079 -0.8796258 0.2386969 -0.0008529 0.2153055 -0.1880715 -0.0038719 0.0001086 -0.0046571 -0.0531793 -1.6021362 -0.4630687 -0.1253254 -0.7141163 -0.7760082 -0.1209673 -0.1850599 -0.1066058 -0.310248 -0.8037076 0.2198354 0.0285346 0.0455845 -0.7746028 -0.1022572 -0.0211908 -0.090244 -0.3187704 -0.7778831 0.0596828 -0.0128243 0.097833 -0.3497361 -0.0293568 -0.0036607 -0.0285877 0.0182225 0.4160648 -0.2909754 -0.0073513 0.1211882 1.1201162 0.0601397 0.0298578 0.0482796 -0.0508748 0.1838499 -0.0242637 0.0045843 -0.2591656 0.0551815 0.0032818 -0.0291217 0.0135082 -0.0960087 1.0412301 0.2297801 0.0603653 0.1157254 0.2799633 -0.0079425 0.0504502 -0.0014768 0.3526472 2.0810396 0.1203963 0.0705423 0.44802 1.2342338 0.2295737 0.1549523 0.1918162 0.2796189 -0.4261681 0.3204429 0.0099505 0.268072 -0.4277822 -0.0153097 0.0094966 -0.0131769 -0.0666656 -0.5636972 -0.038091 -0.0103083 -0.0313939 -0.0196183 0.0053129 -0.0094377 0.007259 -0.1175326 1.3315989 -0.2958435 0.0062463 -0.3046764 0.4346926 0.0229145 0.0034793 0.0218774 -0.0467754 -0.0694251 -0.0966135 -0.0212642 -0.0727048 -0.0513423 -0.0259548 -0.0158934 -0.0266269 0.0579879 0.101645 -0.0456993 -0.0001837 -0.0647204 0.041629 -0.0073576 0.0024405 -0.0104328 0.1522755 -0.0768824 -0.0438685 -0.0022808 0.0314558 0.0342146 -0.0735713 0.0532124 -0.0712644 -0.0876063 -0.0679308 -0.0467126 -0.0144443 0.0446095 -0.029813 0.0973261 -0.0387219 0.0885602 -0.0208749 0.0527854 -0.0338694 -0.0035976 -0.0401155 0.0615698 -0.0066145 -0.0047669 -0.0050593 0.1692943 0.0773181 0.0376434 0.0008033 0.0396968 -0.0172616 -0.0103799 0.0027802 -0.0099826 0.168686 -0.1817432 -0.0025625 -0.0087883 0.0168446 0.0747608 -0.0074842 -0.005751 -0.0078177 0.1156258 0.1125753 0.0438895 0.0816137 -0.0111317 0.0444153 -0.0657731 0.0470258 -0.0811727 -0.0918576 0.1178283 0.0643683 -0.0523413 0.0001202 -0.0267973 0.0939731 -0.0394554 0.1130155 -0.0283567 unknown
polarizability: 184.6474658|-10.009623|138.4432506|2.5668716|6.2405009|56.7741376 unknown
InChI: InChI=1S/C9H8Cl2O2/c1-2-13-9(12)7-4-3-6(10)5-8(7)11/h3-5H,2H2,1H3
charge 0 multiplicity 1
21 atoms
Cl 0.804562 2.98883 0.175071
Cl 4.525933 -1.042869 0.009666
O  -2.190421 -0.536914 -0.198106
O  -1.893979 1.730979 0.226512
C  0.057084 0.241078 0.018069
C  1.103393 1.20265 0.089727
C  0.434799 -1.130973 -0.062063
C  -3.66605 -0.300026 -0.191346
C  -1.397131 0.598067 0.033486
C  2.461895 0.819193 0.085682
C  1.779927 -1.539466 -0.065009
C  2.778584 -0.548283 0.010783
C  -4.329784 -1.644132 -0.471269
H  -0.362958 -1.874455 -0.121919
H  -3.945764 0.116657 0.793159
H  -3.897886 0.457453 -0.961704
H  3.247023 1.577009 0.138918
H  2.046338 -2.597635 -0.124637
H  -5.428066 -1.520741 -0.481037
H  -4.017521 -2.042537 -1.451677
H  -4.071979 -2.383486 0.306295
