program: Gaussian 09
title: 000005465
version: EM64L-G09RevD.01
frameworkgroup: C1[X(C12H16O3)]
method: RPBEPBE
basis: SDD
operation: Freq
keyword: #pfreq=noraman
keyword: PBEPBE/SDD
title: #p freq=noraman PBEPBE/SDD
converged: YES YES NO NO
title: Mulliken charges:
elementType: O O O C C C C C C C C C C C C H H H H H H H H H H H H H H H H
charge: -0.298429 -0.412514 -0.217079 -0.206948 0.487869 0.007395 -0.554537 -0.677198 -0.683431 0.387182 0.230467 -0.536309 -0.819716 0.242200 -0.747840 0.157991 0.248879 0.220382 0.213909 0.228963 0.233376 0.213566 0.215895 0.256533 0.228163 0.228720 0.266178 0.339031 0.250321 0.246975 0.250007
chargesum: 0.00000
title: Mulliken charges with hydrogens summed into heavy atoms:
elementType: O O O C C C C C C C C C C C C
charge: -0.298429 -0.073483 -0.217079 -0.048957 0.487869 0.007395 -0.305658 -0.013943 -0.020594 0.387182 0.230467 -0.279776 -0.096655 0.242200 -0.000538
polarizability: 1.83518463e+02 -2.11903064e+00 1.43919662e+02 3.92162994e+00 3.92321982e+00 9.67405288e+01
1716.lowfreq: -23.1728 -9.1361 -4.6104 -0.9515 -0.0008 -0.0006 -0.0005 42.2111 49.4352
frequency: -21.3391 42.1728 49.4098 70.6281 80.3029 91.9127 129.5174 167.6250 172.8311 209.5914 215.8852 241.6566 263.1913 270.1277 305.6036 320.0714 350.1584 353.5009 413.6313 424.3986 477.6058 490.7952 508.3617 550.4355 569.4414 593.4184 634.9019 704.1169 726.4259 736.3533 762.4860 859.8461 875.0824 886.2463 899.8103 913.5202 953.3118 987.8333 1001.4170 1029.9097 1038.6282 1050.3218 1085.7441 1114.9362 1116.4331 1142.7539 1161.5519 1180.7604 1212.0797 1252.0185 1280.5339 1295.6062 1331.2266 1378.5598 1381.1554 1390.1541 1395.0426 1396.9818 1423.9546 1452.6738 1453.1831 1462.7302 1464.0281 1467.8575 1477.4780 1482.2441 1483.2531 1497.6716 1578.0596 1641.1521 1672.0536 2918.3467 2977.7341 2981.6562 2982.2936 3008.5522 3063.6374 3072.2922 3078.4055 3081.7000 3087.1740 3093.8932 3096.4605 3144.4815 3148.0805 3157.3682 3559.3813
redmass: 2.7253 5.0033 1.5279 4.3188 1.9191 3.0001 1.1349 4.5224 2.7992 1.1483 2.9029 1.1162 2.9607 3.2192 3.8096 4.2412 2.9504 1.3310 3.3162 3.2672 4.2833 3.3609 3.7056 3.0341 3.5653 5.0601 5.2467 5.1402 5.5967 3.2291 3.8984 4.2385 1.4834 2.6074 1.5776 1.1677 1.4599 1.9588 1.4978 2.5647 1.6588 1.5231 1.8917 2.2759 2.2511 1.9166 1.9092 2.9812 2.0905 1.3347 1.3724 5.8370 1.9157 1.1903 1.2389 2.8222 1.2227 1.2178 4.1568 1.0574 1.0511 1.0560 1.0452 1.0518 1.0705 1.1481 1.2023 2.4467 6.3839 7.6149 9.8597 1.0812 1.0349 1.0354 1.0366 1.0367 1.0976 1.1002 1.0996 1.1005 1.1000 1.0993 1.0973 1.1012 1.0909 1.0920 1.0652
irintensity: 0.1436 1.6556 1.8584 0.3698 1.4025 1.7942 0.4732 2.9944 0.7079 0.1090 3.1401 0.1536 1.4181 2.5703 1.7990 3.3652 24.6851 93.9424 0.6740 2.0848 9.5895 8.2376 7.4915 0.5382 3.7360 5.6261 0.9576 1.8960 1.0608 1.5573 10.5252 83.0752 6.6652 4.3394 42.7717 0.7181 0.2554 70.9755 31.1114 27.8586 7.9805 10.6846 9.6559 7.8103 1.0013 401.2737 36.1896 255.2416 23.5262 9.2359 1.3155 9.4891 27.2835 15.2269 60.9803 27.3789 15.8916 10.5146 7.0207 26.8149 22.1195 18.1421 3.6913 3.6364 20.5889 9.7915 23.9531 106.9625 13.9669 6.2625 160.7046 55.8582 29.1156 43.5732 12.7589 2.3434 11.1282 0.6367 90.5419 23.0841 34.7852 20.3258 5.9300 10.7428 7.5675 3.7516 28.1724
temp: 298.150 k
press: 1.00000 atm
elementType: 8 8 8 6 6 6 6 6 6 6 6 6 6 6 6 1 1 1 1 1 1 1 1 1 1 1 1 1 1 1 1
symmnumber: 1
zpe: 661210.8 jmol-1
zpe.correction: 0.251842 hartree
zpe.thermalcorrener: 0.267755 hartree
zpe.thermalcorrenthalpy: 0.268699 hartree
zpe.thermalcorrgfe: 0.208492 hartree
zpe.sumelectzpe: -691.419253 hartree
zpe.sumelectthermal: -691.403340 hartree
zpe.sumelectthermalent: -691.402396 hartree
zpe.sumelectthermalfe: -691.462603 hartree
dipole: 0.9650 -2.1034 -1.6020
dipole: 2.8147
quadrupole: -73.6079 -86.7977 -97.0097
quadrupole: -2.4426 7.1847 -0.3531
quadrupole: 12.1972 -0.9926 -11.2046 -2.4426 7.1847 -0.3531
hfenergy: -691.671095 hartree
pointgroup: C01 [X(C12H16O3)]
dipole: -0.3393725 -0.8051337 0.6803322 debye
polarizability: 183.2609593|4.1464714|143.5857186|3.6198039|-6.5423135|97.3319755 unknown
InChI: InChI=1S/C12H16O3/c1-7(2)10-6-12(15-9(4)13)8(3)5-11(10)14/h5-7,14H,1-4H3
charge 0 multiplicity 1
31 atoms
O  2.061943 -0.576774 0.677328
O  -2.829056 1.953187 -0.513271
O  3.00521 -0.328396 -1.458976
C  -2.837407 -1.048913 -0.063804
C  -1.59046 -0.158764 -0.025704
C  -1.638949 1.248253 -0.239484
C  -0.319819 -0.718601 0.250619
C  -3.178294 -1.60071 1.347545
C  -2.69798 -2.198172 -1.096572
C  0.794737 1.480563 0.092376
C  0.833424 0.078599 0.301276
C  -0.470896 2.042459 -0.178351
C  2.042104 2.337359 0.152723
C  3.090831 -0.731766 -0.283787
C  4.26367 -1.445586 0.351753
H  -3.715272 -0.445703 -0.389279
H  -0.216478 -1.793497 0.432594
H  -2.357857 -2.239017 1.723498
H  -4.098992 -2.212465 1.317178
H  -3.325081 -0.78165 2.074076
H  -2.481329 -1.805309 -2.10564
H  -3.628142 -2.794168 -1.143433
H  -1.87517 -2.881194 -0.817832
H  -0.572528 3.118914 -0.347886
H  1.783203 3.407682 0.206315
H  2.661439 2.085578 1.033086
H  2.666046 2.176999 -0.745959
H  -3.599307 1.333123 -0.55871
H  4.646208 -0.858956 1.20498
H  5.061059 -1.585643 -0.391814
H  3.942643 -2.424634 0.747155
