program: Gaussian 09
title: 000041979
version: EM64L-G09RevD.01
frameworkgroup: C1[X(C13H14O3)]
method: RPBEPBE
basis: SDD
operation: Freq
keyword: #pfreq=noraman
keyword: PBEPBE/SDD
title: #p freq=noraman PBEPBE/SDD
converged: YES YES NO NO
title: Mulliken charges:
elementType: O O O C C C C C C C C C C C C C H H H H H H H H H H H H H H
charge: -0.265215 -0.253582 -0.237543 0.196763 -0.499224 0.551557 0.168270 -0.355333 -0.493210 -0.401507 -0.339504 0.173578 -0.286538 -0.203236 -0.313365 -0.690706 0.224742 0.225231 0.219077 0.217412 0.254132 0.244916 0.256481 0.272193 0.242727 0.242669 0.216829 0.222142 0.205102 0.205144
chargesum: 0.00000
title: Mulliken charges with hydrogens summed into heavy atoms:
elementType: O O O C C C C C C C C C C C C C
charge: -0.265215 -0.253582 -0.237543 0.196763 -0.049252 0.551557 0.168270 0.081156 -0.239078 -0.156591 -0.083024 0.173578 -0.014346 0.282160 -0.096536 -0.058318
polarizability: 3.05947054e+02 -5.48234254e+00 1.47402508e+02 5.05197938e-01 2.90131496e-01 7.78211428e+01
1716.lowfreq: -20.5088 -11.3907 -4.3892 -2.7623 -0.0007 -0.0007 -0.0005 18.0350 26.7619
frequency: -11.5699 11.5785 26.6330 49.5195 62.8475 71.9637 142.8801 149.7952 202.5001 207.5308 227.7563 229.9196 265.9128 339.7667 358.2816 395.6020 424.1897 486.8931 512.6632 532.3174 592.8147 610.8001 676.6506 688.2942 719.1609 732.3292 764.6581 788.0536 811.5918 839.6608 849.8885 874.1640 880.3673 891.6478 921.3450 939.7116 942.3879 978.5271 1012.3025 1047.6490 1059.6785 1064.8288 1080.4197 1081.0808 1120.2138 1131.6584 1139.3702 1193.7676 1212.6134 1239.2397 1265.8552 1273.2224 1280.4358 1311.3854 1320.3884 1355.7440 1365.6801 1386.6075 1392.4908 1430.0812 1456.6655 1468.0833 1477.9459 1479.2037 1482.9807 1487.2770 1557.1713 1601.0608 1623.2549 1643.6812 2946.8879 2969.3364 2990.3663 3002.7812 3018.8890 3043.4622 3072.0334 3073.4071 3094.4558 3098.7347 3113.0608 3147.1365 3179.0203 3186.1626
redmass: 2.2586 2.0256 3.0131 4.5192 4.8565 4.3095 4.3952 3.0175 6.5480 4.2871 1.0750 5.5128 5.2262 3.7467 4.1563 4.7356 2.7810 4.7452 6.5382 2.3939 6.3856 3.6985 8.2548 6.9180 2.6973 1.3711 6.1624 5.5923 1.3426 10.2933 1.4247 1.5261 2.6319 1.6281 2.8208 1.3501 3.7480 4.6015 1.1899 2.1631 3.5721 1.4562 2.7112 1.5724 1.0367 1.5550 2.0646 1.6178 1.3699 1.7239 1.8377 1.5044 1.0917 1.4402 2.2537 1.9026 1.3006 1.2250 3.6275 1.1008 4.2957 1.0620 1.0431 2.2576 1.0700 1.3675 7.9483 7.7215 8.1269 5.6955 1.0601 1.0358 1.0969 1.0612 1.0534 1.1000 1.0990 1.1017 1.0900 1.1191 1.0899 1.0901 1.0927 1.0959
irintensity: 10.9776 3.9384 0.2547 0.2660 5.3488 0.0478 1.0479 0.9190 0.7272 0.0268 0.0698 0.1980 16.2669 0.2852 0.2400 3.6385 5.0842 3.4698 27.3746 0.1062 0.7634 7.9124 0.1875 1.1166 4.2908 3.1101 7.7087 4.7962 55.7226 27.3505 0.2270 23.2767 41.6675 2.5519 1.8017 3.3934 11.6720 151.2866 45.1554 63.5109 29.3772 4.1284 51.7354 1.2865 0.0049 3.8735 156.8430 15.7894 0.4377 277.2993 108.8412 28.6808 0.2597 15.8820 27.9331 33.0655 0.4958 9.5331 114.4768 21.6759 170.5695 7.4830 12.5297 115.4329 13.7135 60.7851 377.3299 18.0917 10.2832 171.2622 32.4613 44.7892 11.5273 17.3349 132.3527 0.4890 58.0405 79.1985 0.4353 28.7663 15.5577 5.5111 2.8736 4.9225
temp: 298.150 k
press: 1.00000 atm
elementType: 8 8 8 6 6 6 6 6 6 6 6 6 6 6 6 6 1 1 1 1 1 1 1 1 1 1 1 1 1 1
symmnumber: 1
zpe: 623125.1 jmol-1
zpe.correction: 0.237336 hartree
zpe.thermalcorrener: 0.252217 hartree
zpe.thermalcorrenthalpy: 0.253161 hartree
zpe.thermalcorrgfe: 0.192013 hartree
zpe.sumelectzpe: -728.243513 hartree
zpe.sumelectthermal: -728.228632 hartree
zpe.sumelectthermalent: -728.227688 hartree
zpe.sumelectthermalfe: -728.288836 hartree
dipole: 3.3527 -2.6964 0.0386
dipole: 4.3026
quadrupole: -86.7622 -93.1495 -96.0135
quadrupole: 5.6851 -0.0919 0.1433
quadrupole: 5.2129 -1.1745 -4.0384 5.6851 -0.0919 0.1433
hfenergy: -728.4808489 hartree
pointgroup: C01 [X(C13H14O3)]
dipole: -1.3209497 1.0582536 0.0269031 debye
polarizability: 305.9609692|-5.2280365|147.3692994|1.0319981|1.0646688|77.8404359 unknown
InChI: InChI=1S/C13H14O3/c1-2-3-11(14)6-4-10-5-7-12-13(8-10)16-9-15-12/h4-8H,2-3,9H2,1H3
charge 0 multiplicity 1
30 atoms
O  -3.451775 1.955538 0.032139
O  -4.880346 0.023659 0.010872
O  3.500884 -1.607886 0.001832
C  -2.678487 0.768422 0.022727
C  4.186746 0.744476 0.075099
C  -0.730127 -0.657498 0.012166
C  -3.524922 -0.366621 0.01012
C  5.648929 0.264412 0.06795
C  -1.293464 0.663743 0.024239
C  -1.598306 -1.78932 -0.001009
C  -3.010212 -1.665359 -0.001878
C  3.15305 -0.386065 0.032683
C  0.714262 -0.894673 0.012843
C  -4.870984 1.514532 0.026088
C  1.725548 0.031767 0.033656
C  6.651217 1.434982 0.14691
H  3.984943 1.360412 0.978353
H  3.994694 1.421265 -0.785624
H  5.803446 -0.430764 0.91413
H  5.827949 -0.334071 -0.844735
H  -0.66325 1.556042 0.03334
H  -1.154467 -2.790744 -0.010155
H  -3.665973 -2.538955 -0.011617
H  1.038536 -1.94633 -0.004836
H  -5.360742 1.882972 -0.891156
H  -5.362771 1.864248 0.949593
H  1.524012 1.11102 0.054396
H  7.693708 1.067924 0.142119
H  6.534092 2.124572 -0.711005
H  6.506612 2.024299 1.072561
