program: Gaussian 09
title: 000041982
version: EM64L-G09RevD.01
frameworkgroup: C1[X(C18H19N)]
method: RPBEPBE
basis: SDD
operation: Freq
keyword: #pfreq=noraman
keyword: PBEPBE/SDD
title: #p freq=noraman PBEPBE/SDD
converged: YES YES NO NO
title: Mulliken charges:
elementType: N C C C C C C C C C C C C C C C C C C H H H H H H H H H H H H H H H H H H H
charge: -0.337799 -0.221184 -0.187447 0.093837 -0.484761 -0.475099 -0.507443 0.425329 0.422440 -0.391372 -0.368920 -0.455431 -0.419117 -0.247635 -0.252447 -0.251512 -0.245349 -0.245628 -0.244504 0.230106 0.236182 0.215754 0.225074 0.274925 0.233173 0.209193 0.210855 0.209452 0.230541 0.247150 0.264930 0.246707 0.225121 0.224289 0.229586 0.222742 0.230204 0.228061
chargesum: 0.00000
title: Mulliken charges with hydrogens summed into heavy atoms:
elementType: N C C C C C C C C C C C C C C C C C C
charge: -0.062874 0.008922 0.048735 0.093837 -0.043932 -0.032733 -0.087136 0.425329 0.422440 -0.160831 -0.121771 -0.190501 -0.172410 -0.022515 -0.028159 -0.021926 -0.022607 -0.015424 -0.016443
polarizability: 2.09426573e+02 1.19001625e+01 1.86557545e+02 -7.55293585e+00 -1.12069326e+01 1.63906237e+02
1716.lowfreq: -12.8713 -0.0007 -0.0006 -0.0002 7.9309 8.8919 33.3599 54.0459 63.4282
frequency: 33.1476 53.9616 63.4258 86.9207 118.6734 132.8857 213.8582 223.8409 252.8194 275.1447 301.5565 312.9277 374.7987 394.2696 402.4496 407.8788 415.7626 471.2815 509.8952 532.6194 565.5475 593.7649 616.9321 618.0746 670.7181 699.7772 703.7307 710.9377 718.2848 741.3385 759.9582 770.3310 820.9591 829.0114 849.8720 859.8244 899.6378 910.6911 919.0386 938.2357 950.5087 970.9908 974.8905 984.2320 990.4664 991.5066 993.3368 997.6773 1014.0938 1023.7286 1031.5535 1042.6941 1070.8517 1081.8163 1088.0699 1125.2911 1145.4656 1148.4937 1159.2881 1172.9766 1173.2627 1174.5226 1191.1086 1198.5993 1201.5983 1229.8226 1239.4481 1276.4707 1283.6873 1315.8135 1321.4987 1327.0632 1339.7289 1343.0547 1361.8599 1373.5215 1377.4164 1390.9607 1432.1261 1434.6933 1468.0325 1472.1807 1478.5040 1485.8776 1490.2793 1586.5138 1588.8179 1607.0307 1611.3129 2981.0222 2982.1982 2985.5068 3026.8888 3034.7679 3045.9208 3093.6254 3114.8825 3119.8269 3121.7463 3126.6664 3127.0613 3140.2958 3140.6759 3147.5270 3153.9461 3164.0148 3165.3616 3341.1499
redmass: 3.7926 3.9262 4.6199 4.7381 3.1735 4.3254 4.0686 3.7369 4.2980 4.3758 3.6331 3.0913 2.1781 2.7624 2.8052 2.8855 3.0918 3.3101 3.4869 2.9272 3.6525 4.3400 6.3827 6.3451 5.2557 4.1539 1.7104 1.7210 3.0814 3.3394 1.8924 2.1951 1.9007 2.8070 1.2604 1.2567 2.1373 1.7129 1.9354 1.6165 2.6558 1.8170 1.4067 1.4882 5.4614 4.6935 1.3738 1.3329 1.4476 2.3237 2.1719 1.5634 2.1455 1.8181 1.6114 1.6738 2.4182 1.2271 1.2562 1.8061 1.0671 1.0814 2.5666 1.1288 1.1792 1.3615 1.4720 1.3627 1.4598 1.5521 1.3838 1.4879 1.3030 1.4391 1.6603 5.7291 5.6156 2.1213 2.2098 2.2662 1.0899 1.2074 1.6179 1.6974 1.3394 5.7731 5.9020 5.9592 5.9597 1.0598 1.0613 1.0634 1.0997 1.0971 1.1025 1.0882 1.0935 1.0844 1.0843 1.0873 1.0872 1.0932 1.0914 1.0955 1.0948 1.1014 1.0994 1.0749
irintensity: 0.0729 0.3187 0.1295 0.0793 1.2413 0.2182 0.6927 1.0860 0.7401 0.2475 0.2878 0.4688 0.1901 2.1285 0.2617 0.2267 0.3146 3.2935 10.7451 0.6115 14.4784 4.7655 0.0648 0.3856 2.0884 0.2724 52.9882 52.6034 6.0487 49.1297 41.1964 33.9595 5.2929 7.4697 0.1076 0.0130 0.8955 10.4949 9.4630 7.7228 1.9524 12.2700 1.1751 1.6942 0.9533 0.7224 0.0545 0.3094 5.7338 4.9666 13.8199 2.4068 3.9109 5.4294 2.0425 1.1761 4.6247 8.7589 8.1232 2.0913 0.2563 0.7803 2.0498 1.9931 0.3400 6.7661 4.4617 4.1821 2.7419 0.5733 0.5825 3.1438 4.2562 4.2825 0.7827 0.7476 1.4238 2.4729 1.7695 12.7615 15.4107 12.3585 37.3609 12.9574 2.2785 3.5140 1.1739 13.7152 6.3751 6.4961 60.7248 25.5061 23.2267 22.2199 46.9207 28.0397 69.1630 3.3057 3.8215 0.8087 2.1041 25.1922 17.0778 35.0258 37.1568 23.2192 16.0559 4.0314
temp: 298.150 k
press: 1.00000 atm
elementType: 7 6 6 6 6 6 6 6 6 6 6 6 6 6 6 6 6 6 6 1 1 1 1 1 1 1 1 1 1 1 1 1 1 1 1 1 1 1
symmnumber: 1
zpe: 840499.9 jmol-1
zpe.correction: 0.320129 hartree
zpe.thermalcorrener: 0.335503 hartree
zpe.thermalcorrenthalpy: 0.336447 hartree
zpe.thermalcorrgfe: 0.277317 hartree
zpe.sumelectzpe: -750.657194 hartree
zpe.sumelectthermal: -750.641821 hartree
zpe.sumelectthermalent: -750.640876 hartree
zpe.sumelectthermalfe: -750.700006 hartree
dipole: -1.9043 0.5322 1.2544
dipole: 2.3416
quadrupole: -120.0143 -106.8655 -107.2359
quadrupole: 6.6207 3.2478 -5.0975
quadrupole: -8.6424 4.5064 4.1360 6.6207 3.2478 -5.0975
hfenergy: -750.9773235 hartree
pointgroup: C01 [X(C18H19N1)]
dipole: 0.7285328 0.1940414 -0.5294461 debye
polarizability: 210.0933078|-11.3933964|187.4170594|-7.9826917|8.8964997|162.3799879 unknown
InChI: InChI=1S/C18H19N/c1-3-7-14(8-4-1)18(15-9-5-2-6-10-15)12-11-16-17(13-18)19-16/h1-10,16-17,19H,11-13H2
charge 0 multiplicity 1
38 atoms
N  -2.940805 -1.604864 1.133323
C  -1.562858 -2.202271 1.386092
C  -2.323019 -2.562553 0.118557
C  0.040273 -0.649978 -0.023117
C  -0.249458 -1.42162 1.313627
C  -1.810642 -2.027692 -1.224714
C  -0.316414 -1.632943 -1.182361
C  -0.748406 0.681992 -0.168999
C  1.555745 -0.296164 -0.015907
C  -0.724655 1.365902 -1.414745
C  2.029804 0.704571 0.875657
C  -1.438945 1.300559 0.905958
C  2.506756 -0.958859 -0.83359
C  -1.382799 2.601217 -1.58934
C  3.400707 1.025591 0.955266
C  -2.097179 2.54185 0.73856
C  3.882344 -0.635518 -0.76123
C  -2.07805 3.197497 -0.511264
C  4.338179 0.355127 0.13515
H  -1.582035 -2.925746 2.211103
H  -2.840974 -3.527323 0.082362
H  -0.150416 -0.747929 2.1867
H  0.5644 -2.16572 1.426346
H  -2.865037 -0.631162 0.779788
H  -2.424847 -1.16351 -1.546293
H  -1.944716 -2.807425 -1.997799
H  0.279128 -2.556073 -1.040727
H  -0.021565 -1.209647 -2.160772
H  -0.169973 0.936986 -2.257008
H  1.315449 1.253618 1.499862
H  -1.469019 0.824931 1.892051
H  2.188104 -1.731056 -1.54004
H  -1.347082 3.102846 -2.563173
H  3.736986 1.80316 1.650698
H  -2.625644 2.990525 1.587414
H  4.595823 -1.159859 -1.407569
H  -2.590121 4.156996 -0.643011
H  5.403462 0.60544 0.191048
