program: Gaussian 09
title: 000005602
version: EM64L-G09RevD.01
frameworkgroup: C1[X(C24H28O2)]
method: RPBEPBE
basis: SDD
operation: Freq
keyword: #pfreq=noraman
keyword: PBEPBE/SDD
title: #p freq=noraman PBEPBE/SDD
converged: YES YES NO NO
title: Mulliken charges:
elementType: O O C C C C C C C C C C C C C C C C C C C C C C C C H H H H H H H H H H H H H H H H H H H H H H H H H H H H
charge: -0.443767 -0.257053 0.166248 0.185391 -0.492148 -0.492160 0.315752 0.331749 -0.745556 -0.744238 -0.743851 -0.744338 -0.599176 -0.422069 0.381537 -0.484693 0.226730 -0.840148 -0.422867 0.455105 -0.378051 -0.396048 -0.373584 -0.347178 0.243186 0.101569 0.208138 0.202575 0.208972 0.201996 0.213531 0.225846 0.224960 0.211053 0.222604 0.215180 0.209218 0.224070 0.214321 0.226689 0.222237 0.213932 0.249893 0.226712 0.225729 0.239552 0.237484 0.250148 0.232252 0.254606 0.235297 0.268158 0.272579 0.381928
chargesum: 0.00000
title: Mulliken charges with hydrogens summed into heavy atoms:
elementType: O O C C C C C C C C C C C C C C C C C C C C C C C C
charge: -0.061839 -0.257053 0.166248 0.185391 -0.081435 -0.081192 0.315752 0.331749 -0.081219 -0.095402 -0.096242 -0.081480 -0.349282 -0.195357 0.381537 -0.258965 0.226730 -0.112964 -0.190616 0.455105 -0.123445 -0.160751 -0.105426 -0.074599 0.243186 0.101569
polarizability: 5.25408864e+02 2.86050888e+01 2.38369801e+02 6.40008493e+00 -1.73486307e+01 1.86019052e+02
1716.lowfreq: -7.5779 -4.5748 -0.0008 -0.0006 -0.0001 6.1661 20.4454 23.9044 30.9457
frequency: 19.7413 23.8521 30.9203 51.6477 56.5596 71.0106 81.6304 98.2178 112.2427 149.3448 171.3433 180.7096 193.8553 200.2272 213.3578 220.3197 232.9089 255.8593 261.4516 265.6246 286.0095 290.1486 306.1298 324.4845 336.0546 347.2635 359.3057 373.7999 383.4501 403.5962 415.2539 440.6892 458.1055 467.8270 486.1818 502.1425 511.0373 527.3307 536.1235 554.8049 584.4746 587.1281 605.0879 629.9146 640.9732 668.8455 688.2633 693.8957 730.8510 757.7365 771.0655 774.0656 818.9312 825.0899 832.2457 850.8097 861.1046 867.4830 885.0802 897.1633 917.8695 927.1051 928.4756 933.1443 955.6966 961.4528 968.1918 988.4595 990.0537 995.2085 998.4614 1002.9288 1020.6306 1022.3677 1032.3405 1055.3221 1061.8950 1080.9158 1081.5788 1112.0355 1123.5338 1151.1392 1163.0659 1182.8005 1191.1278 1196.4405 1202.4338 1219.1713 1223.3955 1239.1479 1260.6587 1267.6206 1292.6179 1301.9886 1313.1938 1321.3629 1336.5708 1343.7821 1346.1479 1363.7142 1373.5650 1375.5139 1386.7592 1390.9411 1394.0766 1396.5438 1407.8582 1421.1015 1453.6492 1459.7776 1463.4227 1466.4018 1467.7331 1471.7413 1475.6434 1477.4415 1483.2355 1484.6562 1487.2227 1489.5616 1494.1568 1499.5034 1554.8454 1558.8099 1599.2686 1613.3434 1622.6939 1639.7371 2971.1641 2971.5182 2972.6200 2973.6902 2974.5444 2976.0162 2980.6205 3024.6313 3034.3937 3060.6284 3064.4447 3064.5798 3069.2875 3070.2817 3075.4349 3076.8081 3079.5742 3080.7495 3090.6522 3098.4283 3124.7898 3127.9361 3132.4557 3149.3487 3149.9666 3174.7721 3181.2279 3531.9980
redmass: 4.2749 4.7479 5.4548 2.7682 3.3632 5.2613 4.7719 3.9430 3.9161 3.6450 4.3268 2.8793 1.7025 1.1866 1.9842 1.3672 1.9793 1.0973 1.1935 2.6794 2.8441 2.6445 3.0646 2.9783 2.6759 2.8953 2.9851 2.8603 2.7995 3.7923 2.8750 3.4077 2.9735 3.7035 5.0246 2.9788 2.9555 2.7483 3.0051 3.3826 2.8378 1.4176 2.9753 6.4203 3.6177 4.7436 3.8303 4.6910 4.4820 3.2912 3.1779 3.4950 4.0497 2.1865 1.5423 1.4469 1.3886 2.9671 2.0156 1.6718 1.5675 1.5094 1.5325 1.7389 1.7205 1.4629 1.4781 1.7557 1.5095 1.9211 2.5271 1.2671 2.4776 1.4609 1.5671 2.4511 1.9716 2.2025 1.6834 1.8462 1.4334 1.6460 1.6765 3.1708 1.7868 2.1603 1.1864 2.6727 2.3088 1.8960 2.2240 1.8725 1.8593 2.0493 1.5836 2.9106 2.2624 1.4807 1.4880 5.3630 1.1998 1.1899 2.6321 1.3927 1.2427 1.2408 2.0237 3.9213 1.0668 1.0595 1.0542 1.0975 1.0850 1.1056 1.1589 1.1868 1.0553 1.0718 1.0699 1.1235 1.5949 2.4554 6.5155 6.5939 5.7966 6.4146 6.5626 8.2735 1.0364 1.0397 1.0464 1.0413 1.0429 1.0428 1.0558 1.0991 1.1026 1.0892 1.0994 1.0994 1.0987 1.0983 1.1001 1.1000 1.0991 1.0988 1.0880 1.0993 1.0857 1.0898 1.0892 1.0954 1.0894 1.0945 1.0948 1.0641
irintensity: 0.0138 0.4568 0.1521 0.0703 0.4044 0.5441 0.3933 0.2758 0.9913 0.0914 0.8214 0.2564 0.1537 0.4730 0.4360 0.4995 0.2611 0.1443 0.1429 0.0671 0.7345 2.2485 1.8708 0.6234 0.2495 0.1342 1.5011 4.5730 0.6394 15.4819 1.1382 3.5115 0.2408 4.5909 6.2300 9.9751 18.1660 20.3338 6.1798 9.1606 34.8294 64.8419 5.2671 0.4074 3.3919 7.6601 65.5088 9.1105 10.2932 4.0385 3.3311 3.3566 5.8496 3.9243 23.4984 5.4457 5.9281 10.5159 2.2956 60.0792 18.6782 2.8693 0.1462 3.0706 0.4510 1.8527 0.3592 23.9755 1.2877 84.4999 149.9009 0.6982 212.6920 10.7506 1.9179 25.1849 8.2556 4.9141 3.5597 23.6635 6.7476 227.5851 1.5234 0.6355 7.1743 4.2918 5.2057 10.3053 2.7250 4.7969 6.2613 14.3336 17.5594 8.8685 8.7663 196.8663 0.8814 2.6598 8.2448 16.8693 2.5590 37.0905 11.6094 9.9494 1.3711 19.9567 21.7359 22.0496 0.1000 0.5053 0.9567 1.3652 16.2435 6.3392 17.1230 7.5221 25.3001 26.4012 10.7983 10.4745 19.0644 45.9996 6.0692 9.4485 307.1213 225.9698 12.0388 343.6061 7.3415 15.2639 45.7031 1.0046 17.7349 87.6453 66.2666 47.8675 46.5241 16.5494 2.4154 4.4870 22.5878 169.6636 7.3677 37.1254 67.5282 17.8969 20.7184 21.7550 16.1827 13.6218 13.4764 24.8657 0.6234 6.0563 4.9359 62.6238
temp: 298.150 k
press: 1.00000 atm
elementType: 8 8 6 6 6 6 6 6 6 6 6 6 6 6 6 6 6 6 6 6 6 6 6 6 6 6 1 1 1 1 1 1 1 1 1 1 1 1 1 1 1 1 1 1 1 1 1 1 1 1 1 1 1 1
symmnumber: 1
zpe: 1189905.0 jmol-1
zpe.correction: 0.453211 hartree
zpe.thermalcorrener: 0.478613 hartree
zpe.thermalcorrenthalpy: 0.479558 hartree
zpe.thermalcorrgfe: 0.397596 hartree
zpe.sumelectzpe: -1079.922861 hartree
zpe.sumelectthermal: -1079.897458 hartree
zpe.sumelectthermalent: -1079.896514 hartree
zpe.sumelectthermalfe: -1079.978476 hartree
dipole: -4.2610 0.5402 -0.7691
dipole: 4.3634
quadrupole: -164.9662 -148.2068 -157.5151
quadrupole: 5.9635 -8.3502 -2.2513
quadrupole: -8.0701 8.6892 -0.6191 5.9635 -8.3502 -2.2513
hfenergy: -1080.3760716 hartree
pointgroup: C01 [X(C24H28O2)]
dipole: -1.6814775 -0.0449651 0.3430622 debye
polarizability: 524.0557279|-34.3148288|219.0228027|8.2535864|-31.3737453|206.7191865 unknown
InChI: InChI=1S/C24H28O2/c1-16(14-17-6-8-18(9-7-17)22(25)26)19-10-11-20-21(15-19)24(4,5)13-12-23(20,2)3/h6-11,14-15,25H,12-13H2,1-5H3
charge 0 multiplicity 1
54 atoms
O  7.621944 -0.911025 1.504918
O  7.934784 -0.267655 -0.70471
C  -3.492811 -1.82432 0.246637
C  -5.300814 0.71125 0.102618
C  -4.94684 -1.7414 0.791695
C  -5.820132 -0.75113 0.005812
C  -2.934476 -0.404907 -0.011932
C  -3.770293 0.752254 -0.101345
C  -3.469618 -2.629235 -1.089145
C  -2.638033 -2.587541 1.299136
C  -6.039279 1.549194 -0.980691
C  -5.637285 1.305399 1.505537
C  -1.539476 -0.254451 -0.215669
C  -3.14828 2.003522 -0.359822
C  -0.916664 0.994144 -0.477217
C  -1.763039 2.134563 -0.55185
C  0.564109 1.08645 -0.657818
C  1.0853 2.082373 -1.681152
C  1.381994 0.285939 0.115029
C  2.843808 0.123249 0.098503
C  3.678908 0.352776 -1.040326
C  3.475853 -0.34566 1.293259
C  5.068079 0.155776 -0.972048
C  4.864335 -0.53669 1.369601
C  5.678305 -0.280224 0.233863
C  7.14754 -0.46711 0.254757
H  -4.916728 -1.445086 1.85906
H  -5.394383 -2.754345 0.758523
H  -5.856579 -1.052339 -1.060164
H  -6.863222 -0.782339 0.377393
H  -3.831997 -3.661184 -0.919586
H  -4.106733 -2.160255 -1.860115
H  -2.44379 -2.687098 -1.495937
H  -1.623553 -2.821839 0.930316
H  -2.538294 -2.000721 2.230578
H  -3.127339 -3.548366 1.54795
H  -5.841277 2.631693 -0.885359
H  -5.740967 1.234497 -1.997394
H  -7.131821 1.40426 -0.881395
H  -5.179989 0.71498 2.319513
H  -5.26126 2.340823 1.595608
H  -6.7328 1.322479 1.661921
H  -0.90512 -1.147555 -0.199151
H  -3.767507 2.905843 -0.413244
H  -1.341269 3.130312 -0.72568
H  0.412541 2.951223 -1.77024
H  1.133664 1.625151 -2.689624
H  2.091852 2.45246 -1.426007
H  0.883449 -0.288133 0.909321
H  3.232806 0.645747 -1.993503
H  2.854056 -0.546918 2.173908
H  5.703883 0.324157 -1.847724
H  5.33285 -0.883728 2.294684
H  8.609505 -1.012563 1.445711
