program: Gaussian 09
title: 000042005
version: EM64L-G09RevD.01
frameworkgroup: C1[X(C13H18ClN3O)]
method: RPBEPBE
basis: SDD
operation: Freq
keyword: #p
keyword: freq=noraman
keyword: PBEPBE/SDD
title: #p freq=noraman PBEPBE/SDD
converged: YES YES NO NO
title: Mulliken charges:
elementType: Cl O N N N C C C C C C C C C C C C C H H H H H H H H H H H H H H H H H H
charge: -0.067896 -0.475984 -0.406293 -0.664116 -0.034334 0.264534 -0.429512 -0.202822 -0.713878 -0.680612 -0.686165 0.500669 -0.603246 -0.406777 0.307206 -0.278814 0.388426 -0.298482 0.266533 0.221659 0.235292 0.204205 0.216509 0.204794 0.231914 0.212916 0.227388 0.213603 0.216984 0.226179 0.207349 0.258350 0.310610 0.361911 0.325682 0.346216
chargesum: 0.00000
title: Mulliken charges with hydrogens summed into heavy atoms:
elementType: Cl O N N N C C C C C C C C C C C C C
charge: -0.067896 -0.114072 -0.139761 0.007782 -0.034334 0.264534 0.027439 0.001383 -0.060660 -0.026705 -0.035653 0.500669 -0.344895 -0.096167 0.307206 -0.278814 0.388426 -0.298482
polarizability: 2.34689390e+02 -1.02784755e+01 1.97428582e+02 2.10165101e+01 1.68742127e+00 1.14841132e+02
1716.lowfreq: -14.2393 -6.9046 -3.2888 -0.0007 0.0004 0.0006 9.4964 25.3284 33.3541
frequency: 5.7088 25.1270 33.2358 56.2669 92.5964 95.8788 118.4188 140.8727 162.8917 180.8164 198.1254 218.2666 236.7147 250.3700 255.1832 265.7851 307.5582 333.5695 338.6908 360.7495 383.4246 408.5131 411.1125 425.0813 442.3890 465.8711 467.1362 489.9290 493.4530 525.8642 563.3851 580.5341 617.9270 639.3925 677.0382 742.4823 751.2962 796.9541 803.4566 813.5819 862.5358 887.8105 900.8516 906.3054 923.6395 931.7906 939.7302 958.2806 1005.1320 1018.8454 1041.7829 1048.8281 1062.0774 1084.9802 1125.2604 1170.8127 1210.9318 1226.4312 1236.6739 1239.6382 1270.5376 1273.2711 1301.5558 1314.1865 1323.4668 1374.3748 1376.2382 1387.3961 1399.6240 1404.7954 1417.1284 1438.8220 1450.4360 1458.4050 1461.5960 1467.9093 1481.3683 1485.9529 1492.4634 1504.3436 1550.0483 1613.6431 1642.3052 2156.9064 2907.0629 2956.1287 2970.9999 2974.9220 2986.0712 3065.0250 3069.6357 3072.3740 3073.4301 3081.5893 3087.8090 3095.3946 3140.7757 3169.7922 3175.5858 3414.0361 3535.1034 3678.4688
redmass: 5.0171 2.9658 3.9647 4.2419 7.7872 3.3064 7.0966 4.7802 1.7594 3.4102 3.9362 2.0663 1.1653 2.5123 1.1387 4.9759 4.9205 2.9437 3.0060 3.5146 7.3358 4.7884 3.4895 3.0292 2.2443 5.3971 1.0653 2.2356 1.4432 3.3257 5.4454 4.9022 3.8509 2.7463 1.9910 3.2620 5.1840 3.7530 4.7484 1.2579 2.9200 2.3292 1.5558 1.7965 1.5993 1.3367 1.2120 3.3498 1.6640 1.4105 2.8747 1.7894 2.3235 3.5415 1.9381 1.3656 2.4677 2.6007 2.2509 1.5913 1.3203 1.9620 1.2601 2.4732 1.3757 1.2092 1.2310 3.2505 1.2088 2.3117 3.4483 1.2018 1.0657 1.0597 1.0509 1.0655 1.0604 1.0959 1.0590 4.2140 6.8778 1.9057 2.2964 12.6133 1.0831 1.0673 1.0361 1.0368 1.0361 1.0987 1.0961 1.0976 1.0989 1.0980 1.1005 1.0996 1.0923 1.0634 1.0916 1.0738 1.0449 1.1047
irintensity: 0.8806 0.3384 0.2761 3.1673 3.5904 5.5275 2.4433 0.3647 1.4067 0.1862 1.1188 5.8727 1.2605 2.0545 0.4832 6.3882 2.5556 3.7645 3.0169 2.7666 1.0956 10.3103 4.0163 10.3999 1.0705 1.7994 2.8961 52.7195 214.3753 2.3076 1.0328 5.5557 3.4623 22.3270 29.5503 11.0252 7.8688 26.1496 42.5086 142.1192 9.1049 3.4614 33.4450 1.7715 4.7435 11.1874 0.4162 25.1938 3.1986 3.6095 27.9877 25.4842 35.1206 30.4125 13.9823 75.8799 71.9567 32.1185 25.0901 22.1196 10.0820 18.9521 11.8203 12.0800 8.0230 33.2112 21.5552 115.2454 26.1573 73.9171 1.0928 23.0009 4.7523 2.7636 0.7727 8.1123 9.8462 7.0987 20.6716 132.3947 8.5094 39.6475 223.8416 80.8135 52.2583 36.6847 29.6332 37.9042 9.0412 4.0981 1.4890 56.4500 22.7279 67.2179 6.6511 73.7728 4.2171 294.8481 3.8800 0.3679 102.4072 44.0284
temp: 298.150 k
press: 1.00000 atm
elementType: 17 8 7 7 7 6 6 6 6 6 6 6 6 6 6 6 6 6 1 1 1 1 1 1 1 1 1 1 1 1 1 1 1 1 1 1
symmnumber: 1
zpe: 762373.9 jmol-1
zpe.correction: 0.290373 hartree
zpe.thermalcorrener: 0.310025 hartree
zpe.thermalcorrenthalpy: 0.310969 hartree
zpe.thermalcorrgfe: 0.239757 hartree
zpe.sumelectzpe: -1204.352838 hartree
zpe.sumelectthermal: -1204.333186 hartree
zpe.sumelectthermalent: -1204.332242 hartree
zpe.sumelectthermalfe: -1204.403453 hartree
dipole: 4.3585 -0.3068 -1.6996
dipole: 4.6882
quadrupole: -98.9149 -129.2375 -119.8580
quadrupole: 17.5280 1.7325 6.6744
quadrupole: 17.0885 -13.2340 -3.8545 17.5280 1.7325 6.6744
hfenergy: -1204.6432108 hartree
pointgroup: C01 [X(C13H18Cl1N3O1)]
dipole: 1.7275022 0.1160998 0.6359423 debye
polarizability: 235.9319694|-2.4520048|189.475202|-23.2117177|-21.4103449|121.5519333 unknown
InChI: InChI=1S/C13H18ClN3O/c1-13(2,3)17-7-11(18)8-4-9(6-15)12(16)10(14)5-8/h4-5,11,17-18H,7,16H2,1-3H3
charge 0 multiplicity 1
36 atoms
Cl -2.679885 3.371558 -0.693969
O  1.479357 0.374735 -1.986086
N  3.222375 -0.719324 -0.312791
N  -4.404903 1.170109 0.497415
N  -4.483603 -2.30229 1.310918
C  4.323667 -0.153988 0.547565
C  1.824042 -0.677367 0.182941
C  0.882244 -0.584081 -1.067581
C  5.649217 -0.472816 -0.185672
C  4.152237 1.380811 0.658217
C  4.337151 -0.797599 1.963383
C  -0.52219 -0.145183 -0.68811
C  -1.444104 -1.053735 -0.136228
C  -0.914382 1.209556 -0.855968
C  -2.738969 -0.631137 0.268531
C  -2.188772 1.620597 -0.459887
C  -3.150498 0.740294 0.115924
C  -3.673508 -1.559204 0.832907
H  3.476293 -1.665851 -0.634035
H  1.536582 -1.542551 0.816841
H  1.689905 0.239808 0.781179
H  0.832006 -1.590729 -1.544182
H  6.509745 -0.069975 0.376475
H  5.796019 -1.565988 -0.287263
H  5.650294 -0.026839 -1.196055
H  3.227623 1.660293 1.194551
H  4.118221 1.839375 -0.345749
H  5.001422 1.815554 1.21543
H  5.155066 -0.378127 2.577513
H  3.387057 -0.610681 2.496407
H  4.486267 -1.892069 1.897197
H  -1.181112 -2.110769 -0.0170
H  -0.207611 1.903379 -1.319076
H  2.468906 0.27091 -1.788588
H  -4.66671 2.144252 0.363096
H  -5.077947 0.519272 0.896751
