program: Gaussian 09
title: 000041948
version: EM64L-G09RevD.01
frameworkgroup: C1[X(C18H12O2)]
method: RPBEPBE
basis: SDD
operation: Freq
keyword: #pfreq=noraman
keyword: PBEPBE/SDD
title: #p freq=noraman PBEPBE/SDD
converged: NO YES NO YES
title: Mulliken charges:
elementType: O O C C C C C C C C C C C C C C C C C C H H H H H H H H H H H H
charge: -0.431453 -0.433626 0.258481 0.457033 0.196062 0.428341 0.430376 0.472355 -0.628407 -0.710546 -0.498792 -0.478036 -0.349114 -0.619730 -0.415876 -0.570059 -0.393410 0.292917 0.301791 -0.405993 0.230481 0.247480 0.240459 0.232139 0.224661 0.231537 0.241722 0.266144 0.252367 0.220460 0.355116 0.355119
chargesum: 0.00000
title: Mulliken charges with hydrogens summed into heavy atoms:
elementType: O O C C C C C C C C C C C C C C C C C C
charge: -0.076337 -0.078507 0.258481 0.457033 0.196062 0.428341 0.430376 0.472355 -0.397926 -0.463065 -0.258333 -0.245897 -0.124453 -0.388192 -0.174154 -0.303915 -0.141043 0.292917 0.301791 -0.185533
polarizability: 4.38524853e+02 1.02099095e+01 2.12054836e+02 1.82872023e-03 -2.14573168e-03 7.59694446e+01
1716.lowfreq: -9.7544 -0.0009 -0.0006 0.0005 3.0218 12.0189 45.1529 72.0285 104.7469
frequency: 45.0936 72.0259 104.7440 124.5139 170.4219 192.6393 238.3640 269.3227 282.5716 300.8276 314.5332 366.8735 367.3681 386.7415 405.5907 406.6971 430.9190 460.6339 468.5186 473.1996 494.4220 534.3147 538.1498 586.8190 598.2517 626.3105 647.7085 686.2588 700.6683 732.2413 760.8683 766.4591 786.1218 797.2965 799.1902 808.2423 836.3288 836.3391 860.1527 875.1788 902.2668 930.4642 942.6450 947.9847 951.5475 958.9091 974.2448 984.1456 1101.9764 1128.3272 1138.4688 1149.4537 1157.7262 1183.5499 1191.6637 1211.0746 1216.8009 1242.1377 1273.0701 1285.0240 1298.0105 1306.5067 1328.6160 1387.6680 1398.0949 1416.1021 1421.9006 1438.5479 1453.4629 1469.3910 1481.6143 1515.1077 1565.8334 1577.2674 1603.8527 1625.1546 1630.5167 1649.6767 3104.9404 3109.2924 3114.8318 3119.5949 3132.1917 3138.5328 3140.5032 3147.4403 3156.6443 3174.1352 3578.4839 3584.2621
redmass: 6.8970 3.9287 6.3714 6.3693 4.0378 6.1095 7.2453 3.8838 6.0533 5.2629 1.1318 5.0951 1.1296 3.5883 5.2727 4.3209 2.8643 5.4612 2.4859 5.1247 5.5132 2.9337 6.8779 3.4442 6.9606 3.5198 6.6228 6.6759 3.1179 6.6287 6.2202 2.1861 1.6035 1.7295 4.9236 1.4417 5.1223 1.7520 1.6239 1.7132 1.6673 1.8718 3.3184 1.4579 3.5655 1.3647 4.5967 1.4219 2.1552 1.6557 1.5126 1.3521 1.2417 1.2972 1.3157 2.0874 1.5630 1.8822 2.2484 1.4692 3.6599 1.8932 2.7100 2.4275 4.4176 4.7550 2.7657 5.8498 5.3604 3.0553 3.4409 3.9152 5.7405 6.6126 6.0020 6.5281 6.8461 6.5783 1.0914 1.0872 1.0861 1.0912 1.0910 1.0964 1.0984 1.0869 1.0923 1.0962 1.0660 1.0661
irintensity: 0.3034 2.6036 0.2777 1.7768 2.3159 0.2046 1.4038 0.0168 1.7665 9.0692 127.5708 15.8789 155.5227 0.0540 0.9258 0.2837 7.4126 17.0661 20.3391 0.2635 29.1492 6.6517 0.0038 7.7864 1.0133 6.5459 3.5932 1.1986 9.0204 3.0367 17.7117 1.6380 7.5404 24.2895 15.9501 0.7246 11.8290 48.2590 4.8171 15.0847 64.9786 44.2822 17.9491 6.9247 38.2846 1.0906 5.8918 0.9107 27.4468 447.7100 83.6233 119.3828 29.4876 18.0712 15.8887 32.6007 9.7536 24.8779 1.1242 1.7176 148.5176 1.3570 0.4525 19.0859 0.5761 17.1819 0.2177 1.7587 8.1266 16.3513 73.7964 93.1908 5.0992 14.9567 63.5334 59.5195 0.3144 158.3915 25.2932 12.0291 1.9499 11.8442 4.3318 25.2204 33.5456 9.1370 9.0092 10.1393 69.4418 72.4547
temp: 298.150 k
press: 1.00000 atm
elementType: 8 8 6 6 6 6 6 6 6 6 6 6 6 6 6 6 6 6 6 6 1 1 1 1 1 1 1 1 1 1 1 1
symmnumber: 1
zpe: 640555.9 jmol-1
zpe.correction: 0.243975 hartree
zpe.thermalcorrener: 0.258911 hartree
zpe.thermalcorrenthalpy: 0.259855 hartree
zpe.thermalcorrgfe: 0.202571 hartree
zpe.sumelectzpe: -842.248622 hartree
zpe.sumelectthermal: -842.233686 hartree
zpe.sumelectthermalent: -842.232742 hartree
zpe.sumelectthermalfe: -842.290026 hartree
dipole: -0.0332 -0.3597 -0.0001
dipole: 0.3613
quadrupole: -94.0649 -99.7061 -123.7063
quadrupole: 22.9402 -0.0011 -0.0001
quadrupole: 11.7608 6.1197 -17.8805 22.9402 -0.0011 -0.0001
hfenergy: -842.492597 hartree
pointgroup: C01 [X(C18H12O2)]
dipole: -0.0129856 0.1415348 0.0000398 debye
polarizability: 438.5118634|-10.3529628|212.0678253|-0.0018301|-0.0021446|75.9694446 unknown
InChI: InChI=1S/C18H12O2/c19-15-4-3-11-10-18-12(7-14(11)9-15)1-2-13-8-16(20)5-6-17(13)18/h1-10,19-20H
charge 0 multiplicity 1
32 atoms
O  6.015262 0.94582 -0.000099
O  -6.163465 -0.0908 0.000008
C  0.358566 0.006735 0.000011
C  -0.127079 -1.368912 0.000026
C  1.808792 0.250491 -0.000012
C  -1.99607 0.787376 0.000004
C  -2.476441 -0.587859 0.000014
C  2.716227 -0.869533 -0.000014
C  -0.597813 1.043458 0.000005
C  -1.513199 -1.632465 0.00003
C  0.830433 -2.458224 0.000026
C  2.187444 -2.221475 0.000008
C  2.376225 1.56022 -0.000055
C  4.124378 -0.650009 -0.000031
C  -2.964732 1.849546 -0.000017
C  -3.887634 -0.843408 0.00001
C  3.760165 1.770993 -0.000079
C  4.640598 0.655389 -0.000049
C  -4.790942 0.217049 0.000005
C  -4.329922 1.579698 -0.000013
H  -0.276229 2.090774 -0.000012
H  -1.855339 -2.67501 0.000036
H  0.445669 -3.485135 0.000035
H  2.89711 -3.057651 0.000011
H  1.724207 2.43911 -0.000063
H  4.798437 -1.517785 -0.000037
H  -2.613847 2.888143 -0.000029
H  -4.265916 -1.870446 0.000025
H  4.185153 2.778716 -0.000112
H  -5.0585 2.401487 -0.000016
H  6.553079 0.115081 -0.000014
H  -6.711618 0.732628 -0.000005
