program: Gaussian 09
title: 000041932
version: EM64L-G09RevD.01
frameworkgroup: C1[X(C16H13NO3)]
method: RPBEPBE
basis: SDD
operation: Freq
keyword: #p
keyword: freq=noraman
keyword: PBEPBE/SDD
title: #p freq=noraman PBEPBE/SDD
converged: NO YES NO NO
title: Mulliken charges:
elementType: O O O N C C C C C C C C C C C C C C C C H H H H H H H H H H H H H
charge: -0.304316 -0.291134 -0.198129 -0.658730 0.097422 0.336718 0.145206 0.277288 0.265353 0.374525 -0.125741 -0.267112 -0.455904 -0.454311 -0.449789 -0.382607 -0.378716 -0.229547 -0.230094 -0.493128 0.291420 0.237926 0.221294 0.218777 0.291815 0.289791 0.377018 0.356996 0.237047 0.237737 0.208314 0.214018 0.240593
chargesum: 0.00000
title: Mulliken charges with hydrogens summed into heavy atoms:
elementType: O O O N C C C C C C C C C C C C C C C C
charge: -0.304316 -0.291134 -0.198129 0.075284 0.097422 0.336718 0.145206 0.277288 0.265353 0.374525 -0.125741 -0.267112 -0.164483 -0.216385 -0.009718 -0.090792 -0.088925 0.007500 0.007643 0.169797
polarizability: 3.43383692e+02 -9.10174965e+00 2.14616447e+02 -7.00050266e+00 -2.13749702e+00 8.30124925e+01
1716.lowfreq: -1.0361 -0.0008 -0.0006 -0.0005 6.6110 13.8664 38.7467 59.7008 86.8690
frequency: 38.6988 59.7004 86.8647 97.9527 118.1432 137.3089 160.7314 183.1871 206.0472 228.7888 261.6029 264.6320 282.0623 326.3719 346.6940 383.2321 392.2708 413.6817 422.0169 443.0522 462.5443 478.8272 503.4029 570.4244 575.4399 601.9142 651.1230 672.5646 680.3216 724.9817 742.9079 750.5212 767.3353 804.8072 808.6442 830.4741 843.9172 874.3099 887.7483 891.2331 940.6369 964.9745 976.6918 990.3620 997.7793 1014.2829 1026.9249 1035.0168 1043.5394 1087.0536 1117.7409 1148.1097 1153.4384 1165.2443 1174.9691 1201.0286 1206.1837 1226.9546 1258.4717 1299.1513 1310.6726 1347.7654 1366.2947 1393.1022 1410.2083 1429.4419 1434.8483 1448.2841 1454.5199 1459.2725 1463.4713 1470.2815 1477.5928 1518.3634 1539.5818 1571.4701 1580.9049 1595.2840 1610.7828 1616.2003 2905.7387 2937.6466 2991.3627 3018.0186 3112.2492 3125.8364 3133.9779 3150.1827 3162.5317 3169.8972 3171.2454 3308.5103 3502.8693
redmass: 5.3282 4.5818 3.4166 4.2782 2.5040 5.2834 5.2461 5.5655 3.2707 1.4869 5.0379 4.9244 4.3754 4.3287 4.4778 6.5356 6.7246 8.8002 3.3351 5.3963 6.2090 5.4268 3.9117 4.9188 6.2379 5.5758 6.6090 4.5628 5.1646 2.5519 1.5762 2.2655 5.0006 2.0775 3.2155 1.2467 1.6832 3.6244 6.9197 2.0014 2.0673 2.2422 2.1007 1.8612 1.4007 1.3668 3.6400 3.1219 2.9040 2.2433 1.2748 1.4010 1.6246 1.4613 1.4039 1.6180 1.2935 2.3937 1.6131 1.9951 3.0743 4.2782 1.5881 6.6463 3.7965 3.2430 1.4089 3.2900 2.4317 1.1068 1.1058 2.6113 1.0937 5.5874 8.2516 2.0757 6.1726 2.6124 6.8553 6.9431 1.0630 1.0342 1.0966 1.1029 1.0985 1.0902 1.0862 1.0904 1.0946 1.0947 1.0991 1.0515 1.1019
irintensity: 4.1652 1.4105 3.1432 1.5329 7.5800 0.5816 3.7925 0.0536 1.3477 9.5829 2.4236 0.7754 1.7657 2.4897 1.1926 8.4869 1.8508 20.7112 0.6801 0.3592 10.6275 1.4770 3.8077 2.7324 6.6543 1.9233 9.0012 6.4525 3.3340 77.7680 41.1500 49.4147 15.9836 6.9264 18.4382 172.4863 4.6749 23.3403 10.1472 8.9734 0.6588 10.1182 52.4846 26.6908 5.8500 0.0045 89.3287 117.1868 36.5632 1.6237 3.8012 2.7677 6.8443 4.9079 3.6842 19.3068 9.0204 5.6167 9.4270 119.8969 470.8834 9.8249 12.1242 28.1750 41.4504 9.5430 10.2528 21.2946 116.5245 24.8564 5.2837 0.8643 8.9726 49.0446 317.9017 4.0603 14.0901 92.8510 23.4405 55.0578 46.7351 118.6329 43.7204 54.8383 21.5655 22.2507 4.2988 9.5117 3.4093 11.7125 23.2234 70.9680 343.4300
temp: 298.150 k
press: 1.00000 atm
elementType: 8 8 8 7 6 6 6 6 6 6 6 6 6 6 6 6 6 6 6 6 1 1 1 1 1 1 1 1 1 1 1 1 1
symmnumber: 1
zpe: 665084.5 jmol-1
zpe.correction: 0.253317 hartree
zpe.thermalcorrener: 0.269699 hartree
zpe.thermalcorrenthalpy: 0.270643 hartree
zpe.thermalcorrgfe: 0.209526 hartree
zpe.sumelectzpe: -896.554819 hartree
zpe.sumelectthermal: -896.538438 hartree
zpe.sumelectthermalent: -896.537494 hartree
zpe.sumelectthermalfe: -896.598611 hartree
dipole: -4.0562 -1.0336 0.8434
dipole: 4.2700
quadrupole: -72.2336 -120.5006 -120.0658
quadrupole: -7.7158 -4.1841 0.9081
quadrupole: 32.0331 -16.2339 -15.7992 -7.7158 -4.1841 0.9081
hfenergy: -896.8081368 hartree
pointgroup: C01 [X(C16H13N1O3)]
dipole: 1.5754678 0.5096671 0.2834405 debye
polarizability: 343.9413128|-2.477634|213.2596006|7.2630175|-10.4647141|83.8117181 unknown
InChI: InChI=1S/C16H13NO3/c1-20-8-9-6-7-12-13(14(9)17)16(19)11-5-3-2-4-10(11)15(12)18/h2-7H,8,17H2,1H3
charge 0 multiplicity 1
33 atoms
O  4.643829 0.794031 -0.606061
O  -0.402923 2.463632 -0.104023
O  -1.786666 -2.882317 0.185989
N  2.14855 1.829731 0.00182
C  0.339634 0.165335 0.072897
C  -0.028161 -1.220962 0.145042
C  1.742441 0.523394 0.092077
C  -2.125862 0.786434 -0.07332
C  -2.499994 -0.585789 0.00305
C  2.735533 -0.519418 0.22388
C  -0.691485 1.205609 -0.03598
C  -1.462366 -1.651949 0.116312
C  0.957454 -2.220923 0.231737
C  2.326171 -1.860074 0.272329
C  4.19167 -0.166585 0.428027
C  -3.131167 1.779365 -0.181815
C  -3.869982 -0.947011 -0.030143
C  -4.491384 1.41318 -0.215512
C  -4.862908 0.045879 -0.139328
C  6.070694 1.103005 -0.476058
H  0.637483 -3.265584 0.274661
H  3.087735 -2.644364 0.359869
H  4.336343 0.307148 1.427591
H  4.816272 -1.082061 0.383244
H  -2.816005 2.825704 -0.237836
H  -4.123653 -2.010122 0.030496
H  1.403903 2.539805 -0.076252
H  3.136962 2.002908 -0.210529
H  -5.263734 2.185308 -0.30061
H  -5.920922 -0.236353 -0.165692
H  6.302259 1.548871 0.514447
H  6.687313 0.191375 -0.614828
H  6.304067 1.827299 -1.27148
