program: Gaussian 09
title: 000005514
version: EM64L-G09RevD.01
frameworkgroup: C1[X(C12H21NO8S)]
method: RPBEPBE
basis: SDD
operation: Freq
keyword: #p
keyword: freq=noraman
keyword: PBEPBE/SDD
title: #p freq=noraman PBEPBE/SDD
converged: YES YES NO NO
title: Mulliken charges:
elementType: S O O O O O O O O N C C C C C C C C C C C C H H H H H H H H H H H H H H H H H H H H H
charge: 1.160823 -0.301355 -0.244671 -0.281564 -0.304232 -0.288451 -0.366550 -0.511749 -0.477814 -0.716719 -0.138690 -0.135209 0.314056 -0.096395 -0.357956 0.378842 0.364646 -0.452716 -0.694409 -0.699142 -0.686089 -0.705701 0.230366 0.257022 0.258124 0.241270 0.245964 0.283594 0.252854 0.216200 0.269231 0.215376 0.220947 0.232647 0.228583 0.230742 0.217059 0.231190 0.222220 0.216889 0.258101 0.362327 0.350336
chargesum: 0.00000
title: Mulliken charges with hydrogens summed into heavy atoms:
elementType: S O O O O O O O O N C C C C C C C C C C C C
charge: 1.160823 -0.301355 -0.244671 -0.281564 -0.304232 -0.288451 -0.366550 -0.511749 -0.477814 -0.004056 0.091676 0.121813 0.314056 0.161728 0.129278 0.378842 0.364646 0.083732 0.006399 -0.016963 -0.007098 -0.008491
polarizability: 1.95586980e+02 2.72670376e-01 2.06917073e+02 -4.56813169e+00 2.60311628e+00 1.58914899e+02
1716.lowfreq: -9.2662 -0.0010 -0.0003 0.0004 6.2534 10.0720 15.4867 37.3403 50.6115
frequency: 11.7311 37.3140 50.5895 59.0256 71.5794 91.7629 96.3519 104.1945 119.2485 144.6436 168.3967 174.7127 181.3728 194.4202 212.2923 223.3171 231.5395 242.4551 259.6843 265.4103 291.4454 297.8691 306.2420 328.7864 328.9901 337.0589 353.2498 366.9360 374.9736 390.3428 401.7888 411.9795 444.1131 465.2499 478.5157 495.3803 510.0208 530.3330 622.8213 625.6091 648.2544 685.4830 708.7052 717.4327 723.5139 730.7204 746.1949 776.7889 792.0401 840.1593 862.6730 893.2477 919.3682 924.0673 926.7936 931.5698 933.3609 937.3697 950.7452 960.5811 982.3630 985.6261 991.8929 998.6558 1017.4322 1046.1685 1070.4140 1089.4888 1098.3008 1129.8643 1145.1106 1154.7142 1174.6448 1204.7929 1214.4237 1223.7466 1241.3820 1246.3940 1249.2223 1258.8374 1266.2825 1298.1503 1325.4759 1334.9866 1349.8823 1357.1928 1375.2639 1380.0568 1381.5399 1393.7470 1396.0839 1428.9325 1448.2009 1450.4977 1454.5751 1454.7129 1466.6709 1470.8220 1474.8478 1476.6913 1479.3705 1540.8145 2970.0258 2995.5733 2996.1050 3000.4211 3001.0144 3001.8763 3003.9952 3022.6368 3065.3543 3081.3484 3097.5582 3098.3180 3101.2567 3105.5621 3107.7418 3109.3244 3110.8316 3116.7185 3126.5053 3448.4438 3623.9688
redmass: 8.4990 4.7121 6.1502 3.8015 4.0162 3.7333 2.7130 4.3153 4.5435 5.3764 1.0472 1.0379 2.9275 2.4225 1.4136 1.6184 1.3288 3.3034 2.9536 3.2095 3.4223 4.8396 2.9058 3.3258 3.0597 3.7794 4.4086 4.1022 4.5809 3.1364 3.5934 3.3095 2.8476 3.6867 3.9091 4.5567 6.9064 5.5451 4.5427 4.6349 5.3274 4.4433 6.2013 5.0552 3.5397 3.4424 5.4123 4.0784 4.4698 4.2008 7.6376 3.4066 2.4551 2.4318 1.5487 3.3326 2.9188 3.5074 2.8767 5.0320 1.3954 1.3818 3.6700 4.5206 2.5998 2.4780 2.3181 1.7560 2.3353 1.8917 2.7210 2.0736 2.4825 2.3354 2.0788 1.4822 1.8897 1.7162 2.7312 1.4073 1.2754 1.3259 2.0110 1.3981 1.3089 1.4410 1.3645 1.2814 1.2874 1.2315 1.2216 1.0890 1.0520 1.0488 1.0490 1.0484 1.0627 1.0666 1.0528 1.0487 1.0709 1.0847 1.0832 1.0577 1.0388 1.0355 1.0611 1.0561 1.0358 1.0635 1.1034 1.0878 1.1000 1.0997 1.1003 1.0996 1.0997 1.1006 1.1006 1.1022 1.1005 1.0408 1.1049
irintensity: 1.7187 4.9661 1.6323 1.9088 2.5346 3.3114 8.8409 2.6165 3.7417 8.2396 0.0668 0.1311 6.1188 10.5133 16.3169 14.0599 0.7233 3.7736 19.7659 1.1660 2.0970 13.0033 9.6044 7.7793 15.3511 13.8661 22.1961 28.2440 4.3438 14.0310 116.0567 9.0557 8.3815 6.8152 21.7060 45.6240 189.5650 41.9709 3.5351 0.3587 12.1695 1.3307 19.7260 14.1450 12.2200 16.7993 29.3842 34.4786 10.4018 37.0870 97.6101 49.8797 14.2857 32.9714 12.1274 43.4992 21.0153 26.3378 54.5766 49.8109 4.3147 17.0021 160.3728 131.4034 26.8641 34.1815 30.4252 30.2383 21.5573 56.3384 49.3146 39.4869 11.6401 197.7269 27.5712 53.2317 28.0013 9.0584 48.0585 6.6465 9.5079 1.1864 1.3942 1.3121 5.6098 8.9590 9.9334 44.4118 37.9205 41.5138 19.9173 22.6746 3.0743 3.9376 2.6287 1.0357 2.0678 3.5256 16.7062 14.7665 8.3165 32.4506 27.8619 4.4964 4.4065 9.0682 24.5109 25.2999 22.0918 15.7101 1.8205 16.3494 0.7659 4.0163 20.7697 30.8714 26.7847 24.2683 21.6017 9.9623 11.8290 76.1122 50.0861
temp: 298.150 k
press: 1.00000 atm
elementType: 16 8 8 8 8 8 8 8 8 7 6 6 6 6 6 6 6 6 6 6 6 6 1 1 1 1 1 1 1 1 1 1 1 1 1 1 1 1 1 1 1 1 1
symmnumber: 1
zpe: 877004.3 jmol-1
zpe.correction: 0.334033 hartree
zpe.thermalcorrener: 0.358261 hartree
zpe.thermalcorrenthalpy: 0.359206 hartree
zpe.thermalcorrgfe: 0.280389 hartree
zpe.sumelectzpe: -1522.499230 hartree
zpe.sumelectthermal: -1522.475002 hartree
zpe.sumelectthermalent: -1522.474058 hartree
zpe.sumelectthermalfe: -1522.552874 hartree
dipole: 0.1392 1.1661 -3.4881
dipole: 3.6805
quadrupole: -123.3139 -136.9969 -137.9059
quadrupole: -3.7716 9.1467 2.7956
quadrupole: 9.4250 -4.2580 -5.1670 -3.7716 9.1467 2.7956
hfenergy: -1522.833263 hartree
pointgroup: C01[X(C12H21N1O8S1)]
dipole: 0.137519 -0.3899801 -1.3877285 debye
polarizability: 196.0447643|-3.3105467|206.0420212|6.3626887|0.9574351|159.3321671 unknown
InChI: InChI=1S/C12H21NO8S/c1-10(2)18-7-5-16-12(6-17-22(13,14)15)9(8(7)19-10)20-11(3,4)21-12/h7-9H,5-6,13H2,1-4H3
charge 0 multiplicity 1
43 atoms
S  2.802768 1.819436 0.238071
O  -1.14926 -2.651198 -0.361114
O  0.560819 -0.559988 0.998132
O  1.178468 -2.225428 -0.537386
O  -2.106321 0.839295 -1.118301
O  -2.685556 1.360651 1.130086
O  2.600579 0.344103 -0.93026
O  1.633409 2.858959 -0.172331
O  3.080912 1.441917 1.774886
N  4.351923 2.359439 -0.41173
C  -0.942441 -1.285602 -0.878232
C  -2.057356 -0.406418 -0.313499
C  0.507508 -0.949157 -0.420796
C  -1.845346 0.138579 1.11433
C  -0.376271 0.52573 1.377468
C  0.192649 -3.305201 -0.221377
C  -2.846875 1.832939 -0.291858
C  1.216039 0.066091 -1.330255
C  0.345459 -3.78457 1.221809
C  0.36244 -4.392914 -1.281713
C  -4.345217 1.804728 -0.615126
C  -2.189253 3.197728 -0.488617
H  -0.996621 -1.275918 -1.986807
H  -3.017915 -0.95277 -0.385404
H  -2.239228 -0.542571 1.884358
H  -0.135906 1.460271 0.838138
H  -0.189549 0.684531 2.449622
H  0.631763 1.004859 -1.39716
H  1.323548 -0.361751 -2.343861
H  1.31104 -4.304585 1.345082
H  0.31697 -2.920606 1.90303
H  -0.470913 -4.48433 1.472706
H  -0.333798 -5.225424 -1.083572
H  0.156725 -3.986524 -2.285805
H  1.395579 -4.780291 -1.260255
H  -4.741227 0.778272 -0.535552
H  -4.525079 2.180021 -1.637379
H  -4.892164 2.441209 0.101496
H  -2.675236 3.941416 0.16546
H  -2.301425 3.523605 -1.53749
H  -1.115186 3.159393 -0.243752
H  5.148541 1.95359 0.092411
H  4.389903 2.363487 -1.436752
