program: Gaussian 09
title: 000041961
version: EM64L-G09RevD.01
frameworkgroup: C1[X(C20H36O2)]
method: RPBEPBE
basis: SDD
operation: Freq
keyword: #pfreq=noraman
keyword: PBEPBE/SDD
title: #p freq=noraman PBEPBE/SDD
converged: YES YES NO NO
title: Mulliken charges:
elementType: O O C C C C C C C C C C C C C C C C C C C C H H H H H H H H H H H H H H H H H H H H H H H H H H H H H H H H H H H H
charge: -0.281020 -0.249369 -0.385114 -0.381430 -0.385451 -0.425120 0.001322 -0.378704 -0.384532 -0.405681 -0.404423 -0.384970 -0.386304 -0.248767 -0.308278 -0.369556 -0.377067 -0.471983 -0.039226 -0.019075 -0.455502 -0.661923 0.194202 0.193469 0.195447 0.195157 0.194627 0.194057 0.216268 0.201371 0.205969 0.192037 0.190647 0.193266 0.194005 0.222493 0.213399 0.206155 0.207587 0.206192 0.198700 0.195815 0.195351 0.211007 0.185514 0.213362 0.200629 0.192346 0.192143 0.211495 0.211611 0.227778 0.227813 0.230512 0.230383 0.224553 0.212457 0.224357
chargesum: 0.00000
title: Mulliken charges with hydrogens summed into heavy atoms:
elementType: O O C C C C C C C C C C C C C C C C C C C C
charge: -0.281020 -0.249369 0.002556 0.009175 0.003232 -0.007481 0.207291 0.003981 0.002739 0.030210 0.009318 0.019922 0.004863 0.147753 0.105713 0.014933 0.046039 -0.016392 -0.039226 -0.019075 0.005393 -0.000555
polarizability: 3.04711511e+02 1.05941307e+01 1.90741897e+02 -6.46891165e+00 -2.07631769e+00 1.81241517e+02
1716.lowfreq: -17.9664 -12.5964 -2.7422 -0.0021 0.0009 0.0017 2.6636 8.8321 14.1294
frequency: -12.6112 -5.9414 13.7374 21.5019 23.4627 37.4712 41.5505 50.3380 65.4964 70.9084 85.8252 100.5344 101.7550 119.0187 125.4273 131.2797 141.0411 146.9192 155.8364 157.6118 188.4931 203.7642 220.2129 251.7165 271.1376 290.0207 308.4237 326.7307 359.1665 378.7287 412.2447 423.7133 449.4924 475.2502 491.2255 505.5378 525.9937 544.4646 667.5366 718.1306 721.0300 728.2849 729.5565 743.5357 766.8906 769.2258 778.6094 796.2759 807.9547 846.9304 855.7151 866.5827 878.2768 912.8453 936.2067 953.0594 966.2980 971.3851 983.4037 992.0470 1004.8107 1014.7731 1021.0857 1025.8462 1037.7498 1052.2989 1052.6005 1062.7685 1069.5522 1078.1113 1080.1697 1081.4093 1082.1336 1104.2001 1106.8746 1110.3258 1123.5841 1151.0413 1165.7714 1171.3988 1182.0748 1190.8586 1198.6960 1216.8242 1228.0245 1243.2390 1252.6759 1253.3034 1255.0323 1264.5167 1270.2962 1275.1147 1277.2349 1279.9861 1286.0527 1286.6765 1294.6556 1296.3603 1300.2178 1310.5735 1318.0397 1325.7967 1330.5570 1341.8698 1343.4767 1347.0811 1351.0056 1352.6220 1354.6483 1357.5266 1363.3454 1385.9566 1386.7735 1443.9127 1453.1875 1455.2573 1457.4431 1458.1937 1458.7462 1461.6342 1463.0798 1464.1613 1467.1340 1471.6930 1472.4239 1473.8111 1477.7175 1482.9929 1484.6513 1486.5112 1494.2004 2276.3065 2932.6903 2947.3852 2948.1584 2949.4965 2951.4456 2953.4256 2957.5640 2959.2214 2964.0532 2972.5511 2975.5543 2980.7785 2982.0271 2983.9462 2984.2263 2985.5359 2986.0169 2987.5011 2990.6280 2995.6449 2998.0253 3000.8055 3002.3710 3005.6891 3012.6860 3016.6187 3026.7600 3038.7453 3040.4405 3052.7543 3054.8632 3056.2340 3070.5408 3080.4150 3085.7669 3096.1465
redmass: 3.0170 3.1638 3.8206 2.7014 3.5183 2.3128 3.0209 2.6514 3.5987 1.9810 2.4529 2.3568 3.0201 2.5977 2.5088 2.6717 3.1002 2.1640 2.1048 2.7025 2.3845 2.3541 2.7951 2.9039 2.2929 3.4216 2.4401 2.7963 2.4770 3.6824 3.4999 3.8446 3.7627 3.4991 3.1883 2.3276 4.1045 3.5788 3.2119 1.0598 1.0694 1.0940 3.2388 1.1193 2.2305 1.5312 1.1725 1.8401 1.2129 2.8244 1.2698 2.2883 2.3625 1.2536 1.6631 2.7207 3.8408 1.3589 4.5207 4.7135 2.6785 3.4012 1.1390 2.8180 3.9120 2.9180 2.2351 2.0115 2.7998 2.2853 2.1943 1.8279 1.8118 3.3094 1.3231 2.0982 2.3236 1.4125 2.5253 1.2879 1.4771 1.6412 1.2487 1.4435 1.2986 1.3295 1.2413 1.1477 1.2982 1.2227 1.2181 1.1090 1.0385 1.3000 1.1000 1.0980 1.1007 1.1190 1.2928 1.3627 1.5159 1.2793 1.3520 1.3919 1.4731 1.5015 1.4474 1.6360 1.6408 1.6388 1.2810 1.4767 1.1956 1.0918 1.0888 1.0807 1.0855 1.0755 1.0722 1.0626 1.0783 1.0736 1.0820 1.0936 1.0418 1.0905 1.0981 1.0991 1.0564 1.0999 1.0879 11.6963 1.0613 1.0588 1.0588 1.0589 1.0593 1.0595 1.0582 1.0591 1.0584 1.0586 1.0660 1.0597 1.0964 1.0592 1.0803 1.0976 1.0595 1.0353 1.0995 1.0609 1.1004 1.1003 1.0993 1.0689 1.1048 1.1006 1.1055 1.1051 1.1004 1.1048 1.1045 1.1012 1.1025 1.1005 1.1001 1.1013
irintensity: 0.0304 0.0027 0.0066 0.0133 0.0318 0.3503 0.2116 0.0161 0.5124 0.0363 0.0782 1.6028 2.3590 0.0283 0.3143 0.1932 1.2993 0.2491 0.4327 3.7459 5.9418 6.2985 1.6430 2.1176 6.4306 5.3278 3.5027 2.7660 0.3369 5.3447 5.9315 2.5380 1.6823 2.2590 1.6293 1.4913 2.1438 3.7253 1.0991 16.8643 1.4868 5.3335 0.3670 0.2526 18.9656 7.1937 6.7192 19.4632 0.0325 15.2361 0.5930 12.7293 57.6529 0.3002 30.3644 1.0978 115.0480 16.9200 39.1452 16.1145 38.5337 0.8278 0.5817 49.6343 15.1592 17.8430 17.4637 5.4853 11.2380 1.6298 1.3473 0.6007 1.9084 5.5483 0.3292 27.1296 21.9286 1.9739 0.2679 6.6038 22.3584 2.2365 25.0086 0.2915 0.2734 0.5385 6.5155 0.6878 0.8507 0.4147 8.9427 1.6946 0.2381 1.1427 0.0832 0.0134 0.2475 0.0677 17.6903 16.4408 13.8060 2.1138 14.5430 0.2005 1.1026 9.3924 0.8355 0.4047 0.3634 0.3021 1.2171 1.4140 9.1736 7.4352 11.7073 1.2358 6.3961 0.0392 0.3916 0.0628 0.0984 5.6035 0.5177 0.0652 11.9587 11.2236 1.4440 0.6434 8.8050 26.7841 11.7087 0.8346 43.6642 1.7302 0.1100 0.5568 1.0766 4.3211 24.4871 3.7134 207.4208 39.7564 43.3615 40.5264 0.3083 53.2020 29.4411 0.1308 48.3802 44.1744 2.8434 44.5054 1.3697 15.5537 17.8809 54.1101 0.9481 13.0428 0.0817 94.2456 33.1219 95.1258 137.2141 92.6337 42.2768 51.2365 51.1379 39.6838
temp: 298.150 k
press: 1.00000 atm
elementType: 8 8 6 6 6 6 6 6 6 6 6 6 6 6 6 6 6 6 6 6 6 6 1 1 1 1 1 1 1 1 1 1 1 1 1 1 1 1 1 1 1 1 1 1 1 1 1 1 1 1 1 1 1 1 1 1 1 1
symmnumber: 1
zpe: 1361668.5 jmol-1
zpe.correction: 0.518632 hartree
zpe.thermalcorrener: 0.544270 hartree
zpe.thermalcorrenthalpy: 0.545214 hartree
zpe.thermalcorrgfe: 0.458388 hartree
zpe.sumelectzpe: -932.312611 hartree
zpe.sumelectthermal: -932.286973 hartree
zpe.sumelectthermalent: -932.286029 hartree
zpe.sumelectthermalfe: -932.372855 hartree
dipole: 0.0213 0.6636 -0.0846
dipole: 0.6693
quadrupole: -135.7084 -137.1619 -136.4779
quadrupole: -3.1325 0.2715 3.8281
quadrupole: 0.7410 -0.7125 -0.0284 -3.1325 0.2715 3.8281
hfenergy: -932.8312432 hartree
pointgroup: C01 [X(C20H36O2)]
dipole: 0.0060453 -0.2521725 0.0756208 debye
polarizability: 304.5506036|-10.5298617|190.0112734|7.8095628|-3.5577224|182.1330476 unknown
InChI: InChI=1S/C20H36O2/c1-2-3-4-5-6-7-8-9-10-11-12-13-15-18-21-20-17-14-16-19-22-20/h20H,2,5-19H2,1H3
charge 0 multiplicity 1
58 atoms
O  -6.268807 0.146975 0.759102
O  -7.870235 0.626404 -0.997753
C  -0.019562 0.846812 -0.198159
C  -1.280884 0.173728 0.38787
C  1.296096 0.163062 0.237109
C  -8.610301 -0.058141 1.285072
C  -7.578887 0.704282 0.439113
C  -2.594789 0.877083 -0.020551
C  2.557091 0.823471 -0.364331
C  -8.759886 -1.519662 0.800776
C  -3.850498 0.182538 0.554512
C  -9.071072 -1.547013 -0.71494
C  3.874934 0.161936 0.098065
C  -5.145827 0.895857 0.158821
C  -7.98942 -0.770041 -1.485605
C  5.133402 0.815776 -0.515514
C  6.450456 0.168863 -0.034596
C  7.70036 0.839314 -0.671695
C  8.977288 0.2495 -0.227809
C  10.039933 -0.253533 0.153299
C  11.305994 -0.871074 0.597103
C  11.431202 -2.363523 0.188578
H  -0.084781 0.845497 -1.306511
H  0.003808 1.913281 0.109838
H  -1.316412 -0.886515 0.061076
H  -1.20576 0.15469 1.495242
H  1.267794 -0.907396 -0.056002
H  1.367165 0.179331 1.34501
H  -8.298932 -0.017874 2.344145
H  -9.579486 0.468314 1.191464
H  -7.590952 1.79577 0.63573
H  -2.662837 0.910348 -1.128147
H  -2.563931 1.93296 0.321237
H  2.572726 1.899399 -0.090643
H  2.496838 0.786241 -1.472348
H  -7.815586 -2.063273 0.993876
H  -9.558893 -2.028293 1.371437
H  -3.89854 -0.865103 0.19819
H  -3.787074 0.140772 1.659353
H  -10.059798 -1.084966 -0.905466
H  -9.111106 -2.588453 -1.089823
H  3.856674 -0.916371 -0.164817
H  3.939538 0.210296 1.205246
H  -5.267941 0.930396 -0.942715
H  -5.156656 1.94129 0.540675
H  -8.233209 -0.664232 -2.555531
H  -7.00816 -1.27702 -1.381322
H  5.075183 0.753551 -1.622715
H  5.142337 1.897632 -0.265202
H  6.454414 -0.910569 -0.282433
H  6.525719 0.240531 1.068035
H  7.689389 1.922545 -0.432066
H  7.624359 0.767635 -1.776257
H  12.158941 -0.302549 0.175713
H  11.390865 -0.78387 1.698678
H  10.610792 -2.958345 0.626418
H  12.392187 -2.781297 0.540394
H  11.383737 -2.473066 -0.908826
