program: Gaussian 09
title: 000005510
version: EM64L-G09RevD.01
frameworkgroup: C1[X(C19H17NOS)]
method: RPBEPBE
basis: SDD
operation: Freq
keyword: #p
keyword: freq=noraman
keyword: PBEPBE/SDD
title: #p freq=noraman PBEPBE/SDD
converged: YES YES NO NO
title: Mulliken charges:
elementType: S O N C C C C C C C C C C C C C C C C C C C H H H H H H H H H H H H H H H H H
charge: 0.030755 -0.285780 -0.163467 0.401698 0.383181 0.472946 0.430574 -0.582488 -0.479315 0.476842 -0.395544 -0.329302 -0.413811 -0.382199 -0.408510 -0.296112 -0.426044 -0.200999 -0.629427 -0.241878 -0.241356 -0.811537 0.253553 0.250153 0.237822 0.261549 0.238013 0.245844 0.239651 0.235619 0.228003 0.253051 0.231670 0.267763 0.228011 0.228029 0.228805 0.240613 0.223624
chargesum: 0.00000
title: Mulliken charges with hydrogens summed into heavy atoms:
elementType: S O N C C C C C C C C C C C C C C C C C C C
charge: 0.030755 -0.285780 -0.163467 0.401698 0.383181 0.472946 0.430574 -0.328934 -0.229162 0.476842 -0.157721 -0.067753 -0.175798 -0.136356 -0.168859 -0.296112 -0.190425 0.027004 0.123057 -0.013868 -0.013326 -0.118494
polarizability: 3.30677481e+02 -1.05001119e+01 2.38580582e+02 2.09718571e+01 -2.30588244e+01 1.66246394e+02
1716.lowfreq: -6.3272 -0.0011 0.0007 0.0010 0.9858 4.3049 12.5729 23.0481 31.1020
frequency: 12.0436 22.9976 31.0872 46.4265 55.3249 60.9278 80.6026 117.2778 141.6600 158.9259 184.9712 190.2121 210.2843 258.0316 279.7425 301.0033 313.8339 324.6173 352.5565 398.0347 417.9159 436.6219 453.3768 477.1539 502.8605 515.8021 516.3316 536.5857 579.3674 591.1925 607.4236 619.9548 645.2245 665.0448 702.1326 717.6773 757.4979 759.2165 773.8947 778.3135 795.5183 818.1287 868.7362 880.3897 889.2076 906.3176 908.3713 916.9736 950.1994 954.3752 971.1058 978.7653 988.9951 991.1069 998.3205 1023.5973 1049.2708 1064.9771 1094.9460 1112.3916 1113.6022 1121.7010 1125.9477 1151.1601 1152.8483 1173.2982 1180.3798 1206.7589 1234.6539 1245.5892 1268.3411 1271.1862 1304.0185 1348.5430 1375.4743 1380.6214 1398.9666 1411.9893 1424.6364 1428.7533 1435.5031 1449.1010 1456.1163 1461.0806 1472.2269 1473.5271 1480.2677 1488.6172 1514.6668 1586.3005 1595.2698 1605.0537 1615.6845 1640.6692 2978.2276 2992.4838 3059.4450 3077.6508 3086.9703 3120.7189 3124.8771 3125.9168 3126.2630 3134.0719 3140.9198 3143.1972 3152.4338 3153.9419 3161.1369 3162.4522 3175.8845
redmass: 4.4023 4.1710 5.4236 4.4282 1.0771 4.7801 5.2938 1.2275 6.4674 2.8114 3.8349 4.7767 3.0208 6.5604 5.3047 4.2247 4.0702 4.6755 4.0175 3.2511 4.3829 3.2415 3.7111 2.5761 4.9077 5.0821 5.3600 5.5366 5.8344 5.5779 6.0592 6.3109 4.4944 3.9179 2.1291 5.7186 2.6643 1.7370 3.7983 2.5525 1.6076 1.4180 1.4668 4.3657 1.3741 2.3686 1.7106 1.7791 3.8742 1.3936 1.4113 1.3407 5.2477 1.3419 1.5943 2.2824 1.5683 4.0089 1.6097 2.0261 1.4078 1.7748 1.9823 1.6395 1.3691 1.0791 1.0933 2.6371 2.6824 1.5567 3.4643 1.8793 1.3583 1.8571 3.4976 5.2496 1.2289 6.0196 3.3726 2.4408 3.2248 1.1847 1.2950 2.1748 1.5506 1.1021 1.2526 1.4487 3.8013 7.5406 5.9151 5.9443 6.4866 6.9969 1.0381 1.0342 1.0960 1.1010 1.0996 1.0856 1.0995 1.0883 1.0891 1.0896 1.0919 1.0950 1.0927 1.0927 1.0992 1.1004 1.0960
irintensity: 0.0911 0.6442 0.4966 0.8312 0.7422 1.5788 1.0269 0.2550 0.4099 2.5642 0.9195 3.2600 1.5601 2.5886 1.1708 2.3629 3.0607 2.5213 1.6028 0.3407 3.1290 2.3131 6.9769 22.3168 1.2732 1.7176 0.2056 0.6977 8.0213 0.4510 3.7506 2.6978 1.7700 6.5582 32.3730 4.6182 14.2533 33.8897 21.0982 5.1559 24.7226 37.1835 24.3106 15.4117 2.1548 3.9084 10.6246 4.6457 43.1049 0.1678 10.1581 0.3589 2.2867 0.0962 1.1806 4.8053 8.1713 102.1097 36.4137 160.8201 38.1557 21.0944 139.1490 106.8716 75.1364 0.3733 0.7973 72.3075 72.3489 37.6560 27.2664 8.1328 6.9532 29.0238 293.2618 107.7635 13.5924 3.1948 2.4779 21.5690 1.5131 98.5296 67.8397 5.7774 6.7440 15.4213 12.8289 203.3452 38.0185 6.7011 24.3619 20.4473 45.4113 18.3638 27.0177 33.1606 21.3345 13.4643 20.0971 3.1058 15.8640 7.5208 0.5227 8.8867 21.4515 33.3963 14.5632 7.4714 14.8552 36.8372 4.7379
temp: 298.150 k
press: 1.00000 atm
elementType: 16 8 7 6 6 6 6 6 6 6 6 6 6 6 6 6 6 6 6 6 6 6 1 1 1 1 1 1 1 1 1 1 1 1 1 1 1 1 1
symmnumber: 1
zpe: 803083.0 jmol-1
zpe.correction: 0.305878 hartree
zpe.thermalcorrener: 0.325792 hartree
zpe.thermalcorrenthalpy: 0.326736 hartree
zpe.thermalcorrgfe: 0.253959 hartree
zpe.sumelectzpe: -1260.729396 hartree
zpe.sumelectthermal: -1260.709482 hartree
zpe.sumelectthermalent: -1260.708538 hartree
zpe.sumelectthermalfe: -1260.781315 hartree
dipole: 2.1416 2.5171 0.9052
dipole: 3.4266
quadrupole: -112.4260 -133.7537 -131.6809
quadrupole: -3.4625 -0.0013 -11.3111
quadrupole: 13.5275 -7.8001 -5.7274 -3.4625 -0.0013 -11.3111
hfenergy: -1261.0352742 hartree
pointgroup: C01 [X(C19H17N1O1S1)]
dipole: -0.6338524 1.1777412 -0.1690536 debye
polarizability: 321.9172637|-16.8024652|224.9404038|43.173648|31.3099061|188.6467887 unknown
InChI: InChI=1S/C19H17NOS/c1-14-6-5-9-17(12-14)20(2)19(22)21-18-11-10-15-7-3-4-8-16(15)13-18/h3-13H,1-2H3
charge 0 multiplicity 1
39 atoms
S  -0.752674 -3.124751 -0.038632
O  -0.411498 -0.394956 -0.243549
N  -2.578119 -1.109456 -0.395719
C  3.198832 -0.056745 0.635976
C  3.823937 -0.673556 -0.517758
C  -2.9906 0.273546 -0.567442
C  1.00599 -0.566072 -0.308599
C  1.767781 -0.016226 0.715233
C  -2.678746 1.250267 0.4053
C  -3.11924 2.588083 0.256447
C  2.989903 -1.21925 -1.550723
C  1.60036 -1.170256 -1.457703
C  4.031073 0.491015 1.66741
C  -3.768388 0.619507 -1.69905
C  5.254773 -0.71701 -0.592582
C  -1.268195 -1.510677 -0.235979
C  -3.901232 2.924579 -0.878497
C  -4.223417 1.946887 -1.846115
C  -3.626096 -2.158407 -0.428763
C  5.42334 0.431752 1.567203
C  6.041072 -0.176516 0.428023
C  -2.746565 3.638481 1.288543
H  1.272756 0.440929 1.578014
H  -2.081867 0.965353 1.277487
H  3.461878 -1.681716 -2.425198
H  0.960768 -1.586753 -2.240238
H  3.558245 0.955433 2.540974
H  -4.001088 -0.13655 -2.456766
H  5.725466 -1.184618 -1.465704
H  -4.256936 3.954115 -1.002915
H  -4.824514 2.219733 -2.720453
H  -3.511623 -2.805235 -1.317013
H  -4.609919 -1.666061 -0.440901
H  -3.538524 -2.801484 0.463589
H  6.050098 0.850402 2.362269
H  7.133848 -0.216491 0.362148
H  -2.790929 3.233017 2.31517
H  -1.713769 4.002447 1.12547
H  -3.41788 4.51304 1.237142
