program: Gaussian 09
title: 000041892
version: EM64L-G09RevD.01
frameworkgroup: C1[X(C13H12O3)]
method: RPBEPBE
basis: SDD
operation: Freq
keyword: #pfreq=noraman
keyword: PBEPBE/SDD
title: #p freq=noraman PBEPBE/SDD
converged: YES YES NO NO
title: Mulliken charges:
elementType: O O O C C C C C C C C C C C C C H H H H H H H H H H H H
charge: -0.313144 -0.252813 -0.431995 -0.059958 -0.330191 0.265346 0.238302 0.420477 0.420476 -0.342492 -0.610502 -0.608289 -0.417638 -0.416857 -0.247458 -0.247190 0.262073 0.220197 0.231553 0.196794 0.214852 0.254918 0.259039 0.240646 0.241462 0.227283 0.227317 0.357789
chargesum: 0.00000
title: Mulliken charges with hydrogens summed into heavy atoms:
elementType: O O O C C C C C C C C C C C C C
charge: -0.313144 -0.252813 -0.074206 0.202116 0.121559 0.265346 0.238302 0.420477 0.420476 0.069155 -0.355584 -0.349250 -0.176992 -0.175394 -0.020175 -0.019872
polarizability: 2.54932351e+02 1.50416103e+01 1.46809137e+02 3.44662407e+00 -4.06271723e+00 7.23074537e+01
1716.lowfreq: -10.4679 -9.2937 0.0006 0.0007 0.0008 3.3564 49.0911 73.7272 106.4805
frequency: 49.0257 73.7132 106.4785 135.1961 148.7961 193.3683 234.3958 275.6331 325.9860 328.2124 367.2876 415.3737 431.0443 441.3997 470.4067 479.3641 497.5372 516.7853 553.5070 590.0524 616.0034 688.9897 702.4260 734.2137 756.1140 771.0156 776.0441 840.1687 845.7153 885.6600 899.2659 909.7491 921.0116 956.0775 959.7161 985.6343 995.8849 1022.2249 1057.3487 1067.7660 1084.1878 1107.2626 1143.3258 1168.5174 1173.6267 1190.7927 1214.4199 1226.1773 1261.9757 1267.1216 1278.0557 1314.9396 1330.2078 1346.5980 1366.5117 1391.3877 1412.2078 1419.9076 1442.4841 1454.5471 1463.3104 1468.9366 1510.1583 1580.5594 1609.2675 1644.4994 2964.9183 2992.3549 3013.1103 3079.5614 3098.4585 3120.5995 3126.2184 3142.8924 3149.4575 3153.2025 3162.2636 3549.0808
redmass: 5.6507 3.8972 4.4316 6.2679 3.6029 3.0837 3.6990 4.2677 5.3315 5.2046 4.0956 5.8028 3.4132 1.2909 2.5652 2.7120 5.2369 4.6908 3.7271 4.8745 6.5627 4.9208 5.3022 4.9957 1.2575 2.6203 3.8772 4.2120 1.3389 1.4314 1.8698 4.5135 1.6427 6.3034 1.4019 1.3331 4.5255 2.2757 2.5168 3.7548 2.8569 2.5518 1.6985 1.3618 1.1850 1.2127 1.2288 1.3181 1.6484 1.9810 2.4281 1.3500 1.7932 1.2403 1.3841 1.3005 5.6761 3.6153 2.5630 1.2074 1.3734 2.0933 4.1259 7.8955 6.2250 7.4365 1.0682 1.0685 1.0805 1.0961 1.1005 1.0854 1.0889 1.0950 1.0916 1.0920 1.1003 1.0655
irintensity: 0.7496 4.4985 2.6536 0.5225 1.4438 7.3740 3.8459 2.0601 1.8749 2.3810 4.3503 3.3080 5.6509 186.0896 23.0770 25.1060 2.3938 10.4263 1.5835 0.5373 6.4357 1.6883 5.3572 17.3541 57.0225 0.0224 5.1483 40.9232 0.6662 76.2178 0.5339 30.7818 21.4230 102.8625 10.4946 0.0107 55.8464 5.8910 44.4256 24.6280 7.6849 2.6960 15.4724 87.7793 28.1024 21.2190 1.7304 10.6863 79.1473 16.3341 276.1569 9.1200 11.0160 29.4172 4.3578 32.0677 0.2837 7.8313 2.4571 10.6248 30.0429 126.5397 110.7942 0.5908 3.9412 2.3532 43.2985 51.3757 46.3772 17.0772 32.2056 3.7389 0.3834 29.6844 9.3212 4.9157 34.7817 9.2363
temp: 298.150 k
press: 1.00000 atm
elementType: 8 8 8 6 6 6 6 6 6 6 6 6 6 6 6 6 1 1 1 1 1 1 1 1 1 1 1 1
symmnumber: 1
zpe: 576885.3 jmol-1
zpe.correction: 0.219724 hartree
zpe.thermalcorrener: 0.232629 hartree
zpe.thermalcorrenthalpy: 0.233573 hartree
zpe.thermalcorrgfe: 0.180276 hartree
zpe.sumelectzpe: -727.092327 hartree
zpe.sumelectthermal: -727.079423 hartree
zpe.sumelectthermalent: -727.078478 hartree
zpe.sumelectthermalfe: -727.131775 hartree
dipole: 0.0848 0.9586 1.0159
dipole: 1.3993
quadrupole: -88.6368 -89.0207 -97.3099
quadrupole: 9.9059 5.2178 -1.4008
quadrupole: 3.0190 2.6351 -5.6541 9.9059 5.2178 -1.4008
hfenergy: -727.3120514 hartree
pointgroup: C01 [X(C13H12O3)]
dipole: -0.035484 -0.3770559 0.3995569 debye
polarizability: 255.1938953|13.964619|146.5099486|-4.1619099|4.0925212|72.3450976 unknown
InChI: InChI=1S/C13H12O3/c14-7-11-8-15-12-5-9-3-1-2-4-10(9)6-13(12)16-11/h1-6,11,14H,7-8H2
charge 0 multiplicity 1
28 atoms
O  -2.020345 0.818399 0.204701
O  -1.498446 -2.036048 -0.061948
O  -4.561484 1.815563 -0.436813
C  -3.074025 -0.142373 -0.23724
C  -2.799337 -1.505806 0.401318
C  -0.700167 0.318842 0.113792
C  -0.445787 -1.093528 -0.015628
C  1.711769 0.765548 0.079515
C  1.968307 -0.655012 -0.076008
C  -4.394689 0.505864 0.189377
C  0.358262 1.221507 0.166259
C  0.862118 -1.561285 -0.115569
C  2.823363 1.670898 0.129982
C  3.325909 -1.108516 -0.174662
C  4.134254 1.198857 0.031146
C  4.387537 -0.202448 -0.122124
H  -3.021913 -0.219233 -1.341551
H  -2.789626 -1.421261 1.506215
H  -3.543402 -2.256302 0.089583
H  -4.426906 0.582371 1.297283
H  -5.248662 -0.099979 -0.157306
H  0.13984 2.289807 0.267337
H  1.029916 -2.638553 -0.216584
H  2.628625 2.743665 0.246782
H  3.518827 -2.181461 -0.292086
H  4.975763 1.899173 0.070376
H  5.420284 -0.559893 -0.198317
H  -3.744487 2.343903 -0.241228
