program: Gaussian 09
title: 000005484
version: EM64L-G09RevD.01
frameworkgroup: C1[X(C15H17NS2)]
method: RPBEPBE
basis: SDD
operation: Freq
keyword: #p
keyword: freq=noraman
keyword: PBEPBE/SDD
title: #p freq=noraman PBEPBE/SDD
converged: YES YES NO NO
title: Mulliken charges:
elementType: S S N C C C C C C C C C C C C C C C H H H H H H H H H H H H H H H H H
charge: 0.253914 0.248979 -0.068489 -0.575206 -0.388220 0.373535 -0.371041 -0.554310 0.327778 -0.623304 -0.295703 -0.306336 -0.286123 -0.283528 -0.152813 -0.147196 -0.523380 -0.522314 0.267588 0.205207 0.217116 0.199878 0.218739 0.170147 0.176292 0.267257 0.225453 0.228960 0.185255 0.259217 0.264308 0.242719 0.242885 0.261525 0.261208
chargesum: 0.00000
title: Mulliken charges with hydrogens summed into heavy atoms:
elementType: S S N C C C C C C C C C C C C C C C
charge: 0.253914 0.248979 -0.068489 -0.102410 0.028774 0.373535 0.017845 -0.110760 0.327778 0.016365 -0.295703 -0.306336 -0.026906 -0.019220 0.089906 0.095689 -0.261855 -0.261106
polarizability: 2.37101170e+02 -2.63388877e+00 2.27929844e+02 -1.00100928e+01 -1.61960241e+01 1.46220432e+02
1716.lowfreq: -4.9952 0.0025 0.0032 0.0033 6.8516 8.5203 26.8949 40.4674 53.1387
frequency: 26.8048 40.4456 53.1290 62.8012 70.7125 79.8450 136.7876 159.2213 213.8916 216.1111 225.4483 246.4786 261.6264 306.4556 321.5437 345.9196 383.8897 418.5720 436.5626 462.6512 479.6112 511.9369 553.8437 570.9008 576.3963 611.8916 636.1169 674.8895 686.9927 698.0589 699.0728 709.7234 757.3770 782.0942 807.2002 830.3694 834.5715 841.7251 850.3850 873.3648 905.0947 907.6571 911.9753 935.2258 984.3884 1014.4238 1036.5827 1041.9358 1062.9051 1067.0874 1084.5829 1085.9004 1106.6381 1123.2008 1142.7339 1158.1675 1172.4422 1175.9451 1220.5105 1233.9014 1247.1592 1256.0589 1276.6476 1284.3929 1314.9887 1332.2353 1338.7504 1350.4951 1353.3957 1367.2887 1429.2874 1453.4267 1456.7380 1460.5029 1464.0361 1469.8702 1471.5897 1474.4953 1479.9057 1534.7480 1543.8287 1606.8844 2774.1826 2808.5295 2850.7096 2932.3726 2992.9074 3018.4607 3025.3010 3057.7881 3062.8250 3077.9363 3082.9821 3163.1595 3164.5068 3182.0932 3183.1233 3233.9301 3234.0595
redmass: 5.9349 5.1141 5.4985 3.7282 5.4468 4.1841 3.8093 3.5165 3.2118 1.3087 4.6652 3.5728 2.9602 5.3057 2.1566 2.7400 2.5816 2.5402 4.8506 3.7427 3.5708 3.6329 3.9871 4.2961 4.5824 5.9463 5.6132 6.7866 6.0567 1.3584 1.1818 3.5228 2.8566 5.4626 3.9069 1.9761 1.9840 1.6289 2.2944 1.6882 2.0739 1.3940 1.5613 1.9622 2.0801 1.9367 1.8041 1.7748 1.7505 1.9216 1.1702 1.2853 1.3901 1.6970 1.5500 2.6798 2.1001 1.7206 1.3790 2.2130 1.3707 1.7166 1.8878 1.4938 1.3714 2.2600 1.4371 1.8831 1.9923 1.4694 1.1707 1.0917 1.0816 1.0789 1.0802 6.6109 6.6749 1.1068 1.0563 5.7459 6.3514 8.5289 1.0700 1.0701 1.0573 1.0695 1.0606 1.0720 1.0863 1.1032 1.0865 1.1009 1.0907 1.0900 1.0900 1.0970 1.0971 1.1001 1.1000
irintensity: 0.0512 0.1172 0.5362 0.5316 0.5695 0.7610 0.3074 0.7466 2.7659 0.1859 0.6138 1.0003 1.4318 0.0941 2.1356 1.4133 0.7678 2.1814 1.8513 0.8817 0.9661 10.7894 1.6516 0.2924 0.4269 2.3537 3.0668 1.3666 2.3632 99.3291 59.2649 31.8560 12.9078 29.0237 28.3014 8.5330 12.0029 11.4600 1.8890 7.6429 0.2483 0.9121 0.1979 9.7898 4.5529 5.8354 24.6139 13.0700 2.5209 34.8697 11.5119 0.8307 22.1505 14.0251 0.2929 15.4931 21.6003 13.6295 13.1039 2.7129 49.9762 4.4985 8.8203 9.7230 1.5065 0.0221 0.5343 5.3228 4.8508 4.5089 1.5687 9.7971 21.6456 6.8176 3.6794 1.9680 7.8058 12.6749 6.8001 0.3970 1.0628 17.1671 57.3672 107.9903 198.2211 35.6487 34.1109 39.1323 73.3735 49.5888 9.5562 33.7478 15.2422 7.5611 7.1712 6.0735 4.5474 1.2712 1.0442
temp: 298.150 k
press: 1.00000 atm
elementType: 16 16 7 6 6 6 6 6 6 6 6 6 6 6 6 6 6 6 1 1 1 1 1 1 1 1 1 1 1 1 1 1 1 1 1
symmnumber: 1
zpe: 733540.0 jmol-1
zpe.correction: 0.279391 hartree
zpe.thermalcorrener: 0.296560 hartree
zpe.thermalcorrenthalpy: 0.297505 hartree
zpe.thermalcorrgfe: 0.232940 hartree
zpe.sumelectzpe: -1431.291003 hartree
zpe.sumelectthermal: -1431.273834 hartree
zpe.sumelectthermalent: -1431.272889 hartree
zpe.sumelectthermalfe: -1431.337454 hartree
dipole: 1.7612 -0.3585 -0.8082
dipole: 1.9707
quadrupole: -113.5666 -109.1901 -122.6795
quadrupole: 0.9253 -3.6477 -4.1247
quadrupole: 1.5788 5.9553 -7.5341 0.9253 -3.6477 -4.1247
hfenergy: -1431.570394 hartree
pointgroup: C01 [X(C15H17N1S2)]
dipole: 0.5993694 -0.3646783 -0.3299939 debye
polarizability: 233.2196674|-6.0702169|229.3558034|-18.0852557|-15.1723909|148.6759746 unknown
InChI: InChI=1S/C15H17NS2/c1-16-8-2-5-12(11-16)15(13-6-3-9-17-13)14-7-4-10-18-14/h3-4,6-7,9-10H,2,5,8,11H2,1H3
charge 0 multiplicity 1
35 atoms
S  -1.164424 2.567442 1.131563
S  -3.239109 -0.01162 -0.795104
N  3.039284 -0.807895 0.331872
C  0.65406 -2.148013 -0.671226
C  1.686368 -2.880594 0.223382
C  0.68809 -0.647374 -0.440017
C  3.081889 -2.257497 0.036992
C  2.092249 -0.070638 -0.551712
C  -0.431171 0.122996 -0.182888
C  4.376479 -0.185747 0.321582
C  -0.389101 1.60101 -0.207096
C  -1.742315 -0.49315 0.128094
C  0.165023 2.463369 -1.151103
C  -2.067659 -1.441442 1.094317
C  0.005176 3.862917 -0.8498
C  -3.461134 -1.807619 1.127199
C  -0.679797 4.094461 0.333105
C  -4.226608 -1.139809 0.184019
H  -0.357502 -2.560247 -0.535533
H  0.941635 -2.327329 -1.731959
H  1.393058 -2.793744 1.286238
H  1.71789 -3.955397 -0.038679
H  3.8105 -2.730508 0.72173
H  3.434183 -2.453547 -1.013163
H  2.428082 -0.122792 -1.626368
H  2.106483 0.990411 -0.254271
H  5.034487 -0.708841 1.038313
H  4.299013 0.870456 0.636074
H  4.8700 -0.211985 -0.684351
H  0.644538 2.09367 -2.061444
H  -1.319582 -1.839202 1.785202
H  0.37252 4.665427 -1.494084
H  -3.879863 -2.529383 1.832752
H  -0.948599 5.042935 0.795193
H  -5.295742 -1.212521 -0.008531
