program: Gaussian 16
title: OPT
version: ES64L-G16RevA.03
frameworkgroup: C1[X(C44H24Ni)]
method: RwB97XD
basis: def2SVP
operation: Freq
keyword: #P
keyword: Geom=AllCheck
keyword: Guess=TCheck
keyword: SCRF=Check
keyword: GenChk
keyword: RwB97XD/def2SVP
keyword: Freq
converged: YES YES YES YES
title: Mulliken charges:
elementType: C C C C C C C C C C C C C C C C C C C C C C C C C C C C H H H H H H H H Ni C C C C C C C C C C C C C C C C H H H H H H H H H H H H H H H H
charge: 0.022988 -0.138147 0.022979 -0.138104 -0.162359 0.010101 0.040417 0.071902 -0.162346 0.071893 0.040437 0.010085 -0.055495 0.058426 0.020941 -0.005842 -0.055497 -0.055831 -0.008115 -0.005840 0.058446 0.020933 0.076498 0.013527 0.076500 -0.055829 0.013527 -0.008113 0.005059 0.001285 -0.000069 0.002503 0.002504 -0.000070 0.001286 0.005061 0.366600 -0.038928 -0.050478 -0.002616 -0.006800 -0.043049 -0.016984 -0.011631 -0.002618 -0.050476 -0.038929 -0.006799 -0.002616 -0.017005 -0.043048 -0.002619 -0.011626 0.004615 0.018957 0.020233 0.003808 0.006790 0.021448 0.018659 -0.002506 -0.002504 0.018658 0.021447 0.006789 0.004613 0.018955 0.020230 0.003791
chargesum: -0.00000
title: Mulliken charges with hydrogens summed into heavy atoms:
elementType: C C C C C C C C C C C C C C C C C C C C C C C C C C C C Ni C C C C C C C C C C C C C C C C
charge: 0.022988 -0.138147 0.022979 -0.138104 -0.162359 0.010101 0.040417 0.071902 -0.162346 0.071893 0.040437 0.010085 -0.055565 0.058426 0.020941 -0.003338 -0.055566 -0.054547 -0.003055 -0.003337 0.058446 0.020933 0.076498 0.013527 0.076500 -0.054543 0.013527 -0.003052 0.366600 -0.032138 -0.052982 0.016041 0.014647 -0.038436 -0.013193 0.008599 0.016337 -0.052982 -0.032138 0.014650 0.016043 -0.013197 -0.038434 0.016338 0.008606
polarizability: 7.58024951e+02 9.78683133e-04 5.88255229e+02 -4.96193578e+01 9.58994572e-03 2.74608690e+02
1716.lowfreq: -262.8228 -1.0411 -0.4604 -0.0045 -0.0024 0.0008 2.2123 20.4204 26.9361
frequency: -262.8228 20.4174 26.9355 27.5627 33.4110 40.5991 57.3477 63.4374 78.7724 94.9906 109.3192 120.1932 129.4378 139.0824 143.4751 176.3352 192.8795 196.1733 203.9632 220.0000 230.7392 240.9174 253.9584 273.2065 292.4527 292.6046 308.1136 325.2775 343.9032 353.7852 365.6792 412.9962 419.5024 436.5111 439.9565 448.9365 450.6147 463.8929 489.8994 494.4921 496.5714 503.2241 519.1196 519.4625 527.6449 543.0710 543.8394 545.2699 545.5693 574.3255 575.5473 585.3201 590.9102 604.2961 604.3532 622.7023 626.7008 641.1412 648.1080 669.8492 672.2303 687.5662 688.3777 699.9675 700.3483 730.6323 734.0410 770.9749 772.0419 776.6648 777.8649 787.5386 788.1956 811.6249 811.9760 837.7973 838.5221 841.3281 842.0396 845.5078 846.0893 861.1280 861.4282 886.7383 887.3565 897.8054 899.4549 918.2961 918.5402 925.6295 926.2119 926.6407 927.2734 947.3013 948.1980 1001.2480 1001.6228 1005.0986 1005.1330 1016.0930 1016.2505 1022.6362 1022.7092 1036.0791 1036.2874 1038.8088 1038.8438 1058.5838 1058.8031 1070.6462 1071.0496 1092.9857 1105.8376 1110.1050 1111.1279 1159.6526 1159.8196 1163.7512 1163.7936 1173.4554 1175.5682 1181.1623 1181.2334 1185.3887 1186.0273 1211.9023 1214.8732 1246.4220 1246.4586 1265.0636 1265.6855 1266.8118 1268.8844 1277.5625 1278.5498 1303.6486 1305.6002 1326.9333 1327.2009 1362.3080 1373.6656 1392.3290 1393.9015 1418.1650 1418.7151 1438.5668 1439.3212 1451.7364 1451.7932 1463.0939 1463.6080 1477.2094 1478.2787 1486.0099 1487.1848 1492.1614 1492.5343 1518.7635 1520.2688 1569.0891 1571.5266 1583.6573 1584.4758 1598.0256 1603.4064 1646.7049 1647.1369 1658.8765 1680.9969 1690.8431 1691.1752 1698.8193 1706.7770 1716.5414 1719.1443 1721.5529 1724.9637 3198.3785 3198.3860 3198.9459 3198.9787 3201.6259 3201.6322 3205.0548 3205.0740 3208.7938 3208.8169 3211.5821 3211.6792 3220.5282 3220.6011 3224.9090 3224.9363 3229.4799 3229.5374 3239.3702 3239.3780 3259.5462 3259.5969 3259.8998 3260.0454
redmass: 13.3766 6.2536 6.7521 5.3021 5.4870 5.0967 4.3572 4.3890 5.0532 5.7383 4.9326 4.8373 6.5968 7.8829 4.4198 4.9736 4.2824 4.4486 4.1641 4.7499 6.0255 7.1761 6.5852 4.8908 5.6212 5.6737 7.6455 9.7183 6.4982 5.2260 5.7822 3.8478 3.4021 3.3975 3.5971 4.4111 4.1321 4.8903 6.1175 5.6545 6.0534 5.1903 3.7485 3.7243 5.7533 7.0560 6.9196 6.9677 7.0978 3.3456 3.3437 3.2896 3.4108 4.1633 5.5542 4.1093 5.3078 7.7537 7.3468 7.2845 7.2956 5.6515 6.4089 4.1254 3.7889 2.1620 2.1964 1.9365 1.2863 2.3203 6.4798 1.4012 1.3865 6.1173 6.0960 1.8627 1.6841 1.8843 1.8741 1.6780 1.8788 6.7630 6.5887 5.1898 5.3218 2.6566 2.6403 2.1791 2.1458 5.0298 4.7667 2.2190 2.2198 5.1491 5.0736 1.3712 1.3747 1.3765 1.3817 1.4248 1.4238 1.3839 1.3823 1.3610 1.3624 1.3707 1.3718 2.0761 2.0721 2.2215 2.1907 4.3809 3.6709 2.9380 2.8978 1.5506 1.5650 1.3438 1.3542 1.2426 1.2467 1.2150 1.2179 1.2643 1.3013 1.4347 1.5217 1.9549 1.9664 1.7711 1.8890 1.9758 1.9676 1.8221 1.8398 2.1006 2.0998 2.3503 2.3806 3.5048 3.9282 4.8114 4.8874 7.5372 7.5821 3.7904 4.0050 6.0699 5.2806 2.5572 2.5895 2.2567 2.3765 2.5170 2.5796 4.1902 4.3764 4.3420 4.4670 3.5906 3.6251 4.9461 5.0407 6.1526 6.0317 7.9791 7.9839 9.3755 7.9776 6.5708 6.5559 6.7121 7.0308 7.0850 7.2862 7.0813 7.9838 1.0877 1.0877 1.0879 1.0879 1.0909 1.0909 1.0915 1.0915 1.0904 1.0904 1.0925 1.0925 1.0955 1.0955 1.0988 1.0988 1.0993 1.0993 1.0960 1.0960 1.0908 1.0910 1.0936 1.0936
irintensity: 0.2203 0.0041 0.2070 0.0664 0.0570 0.0888 0.0024 0.0899 0.7053 0.0185 0.0523 0.0732 0.6145 0.2595 0.0395 0.7846 5.6579 0.0162 2.9340 0.8963 0.8476 0.0236 6.3399 0.0162 0.0042 2.4746 1.0954 15.6490 2.7738 0.3833 0.1273 0.1361 0.0012 0.0357 8.7003 0.3178 6.5058 0.2925 11.4106 5.1720 0.6989 1.4390 0.1772 0.0160 0.3570 2.3364 3.8456 0.4162 0.4771 0.5416 0.0131 0.1203 22.6466 12.9211 4.8002 4.7999 1.3601 8.9798 1.2559 3.0782 1.7222 17.4002 26.6163 0.6692 21.2008 0.7788 2.3717 24.1438 1.1568 49.1717 4.5564 0.1670 3.0947 0.0371 2.6949 2.0734 50.4143 10.9625 81.2597 3.1422 10.4977 16.2032 24.9528 1.0456 13.0235 2.4789 0.1622 1.1140 0.4641 0.8158 2.7960 1.1989 0.3713 7.7636 0.6602 2.6393 0.0717 1.6448 0.2067 0.6763 0.0109 1.1004 0.1100 0.5139 0.0198 0.1418 0.0298 9.5935 17.5304 0.0362 8.5809 6.6564 5.3459 0.0036 0.2321 0.1207 2.1831 19.0434 8.9488 1.9553 2.8124 0.0386 0.0784 1.0497 0.5970 1.3850 1.6428 6.3912 5.8182 0.7270 0.5806 2.8169 19.8785 7.8785 4.3050 46.7561 0.0310 5.3280 4.6487 16.1234 0.2413 3.5796 2.2530 0.2813 1.2597 3.0342 2.3603 3.1004 16.0878 0.3327 0.7108 9.8927 0.8983 33.2870 2.2997 1.2113 0.3901 7.8900 4.0776 4.5005 0.2818 11.8992 5.0543 0.8549 20.7388 1.5798 0.0576 0.4339 55.3256 0.5848 0.0491 8.1706 26.0438 0.4128 6.1743 0.0269 23.9821 3.5529 0.1175 0.9497 1.7256 10.6109 0.7847 6.0032 9.2568 7.9625 2.7916 4.1215 18.7137 39.1403 3.5577 19.2089 13.3452 5.5020 27.2377 1.2942 0.3758 21.4852 8.2258 6.4397 2.5951
temp: 298.150 k
press: 1.00000 atm
elementType: 6 6 6 6 6 6 6 6 6 6 6 6 6 6 6 6 6 6 6 6 6 6 6 6 6 6 6 6 1 1 1 1 1 1 1 1 28 6 6 6 6 6 6 6 6 6 6 6 6 6 6 6 6 1 1 1 1 1 1 1 1 1 1 1 1 1 1 1 1
symmnumber: 1
zpe: 1414570.0 jmol-1
zpe.correction: 0.538781 hartree
zpe.thermalcorrener: 0.569709 hartree
zpe.thermalcorrenthalpy: 0.570653 hartree
zpe.thermalcorrgfe: 0.476679 hartree
zpe.sumelectzpe: -3196.969768 hartree
zpe.sumelectthermal: -3196.938840 hartree
zpe.sumelectthermalent: -3196.937896 hartree
zpe.sumelectthermalfe: -3197.031871 hartree
dipole: 0.0003 -0.8949 -0.0001
dipole: 0.8949
quadrupole: -229.7846 -232.7829 -272.7768
quadrupole: 0.0001 -2.7378 0.0027
quadrupole: 15.3302 12.3318 -27.6620 0.0001 -2.7378 0.0027
hfenergy: -3197.5085491 hartree
pointgroup: C01 [X(C44H24Ni1)]
dipole: -0.0000905 0.3520975 -0.0000278 debye
polarizability: 760.2324385|-0.0119992|588.2552299|37.28367|0.011339|272.4012021 unknown
InChI: InChI=1S/2C22H12.Ni/c2*1-3-7-17-15(5-1)9-11-21-19(17)13-14-20-18-8-4-2-6-16(18)10-12-22(20)21;/h2*1-12H;
charge 0 multiplicity 1
69 atoms
C  -1.71886955 -1.1718578 0.26518102
C  -0.79657428 -0.25649146 0.58733596
C  1.71892975 -1.17196259 -0.26484002
C  0.79665277 -0.25653997 -0.58688999
C  3.09776996 -0.91279739 -0.44350308
C  1.02372542 0.97647786 -1.25751255
C  2.39968935 1.3085591 -1.34762584
C  3.43565455 0.36401186 -0.95434376
C  -3.09773315 -0.91267157 0.44358175
C  -3.43566183 0.36411733 0.95444061
C  -2.39972221 1.30861911 1.34789281
C  -1.02374734 0.97652827 1.25792509
C  -2.73772331 2.62654525 1.80369741
C  -0.01235887 1.88690088 1.74768537
C  -0.39911366 3.18965874 2.15291139
C  -1.78659001 3.53367824 2.14986312
C  2.73765487 2.62645755 -1.80353757
C  4.8303911 0.67521955 -1.09529828
C  5.80288415 -0.21876997 -0.76412919
C  1.78649253 3.53355039 -2.14972796
C  0.01229199 1.88679998 -1.74727472
C  0.39901889 3.18951523 -2.15267152
C  4.12444484 -1.86904922 -0.09436598
C  5.4868727 -1.51851598 -0.25591528
C  -4.12436817 -1.86887396 0.0942016
C  -4.83041479 0.67534934 1.09519064
C  -5.48681347 -1.5183078 0.25552495
C  -5.80287401 -0.21859116 0.76378725
H  6.85439805 0.05150933 -0.88951604
H  5.13560371 1.64412121 -1.48762929
H  3.78189956 2.93115223 -1.84775422
H  2.07731637 4.54027332 -2.45888344
H  -2.07744118 4.54042892 2.45890222
H  -3.78197122 2.93124348 1.84781076
H  -5.1356717 1.64422567 1.48754961
H  -6.85440192 0.05170683 0.88901624
Ni 0.0000637 -1.8518252 0.00025215
C  6.49216238 -2.45414583 0.08878139
C  3.80580997 -3.14962376 0.41398474
C  4.799277 -4.04606878 0.74280543
C  6.15629806 -3.69681751 0.57887188
C  -0.58585622 4.11217927 -2.57929899
C  -1.35268421 1.52832457 -1.86405967
C  -2.29411972 2.43878951 -2.29140623
C  -1.91308331 3.75061592 -2.6357892
C  -3.80567434 -3.14941685 -0.41418784
C  -6.49206701 -2.45387771 -0.08943882
C  -6.15614772 -3.69651877 -0.57957124
C  -4.79910727 -4.04580244 -0.74327382
C  1.35260965 1.52844104 1.86460118
C  0.58573512 4.11237903 2.57947872
C  1.91296207 3.75083281 2.63607288
C  2.29402069 2.438962 2.29188113
H  0.27152712 5.11686495 2.87372809
H  2.66552837 4.47010542 2.96617723
H  3.34011685 2.13494561 2.36699844
H  1.6647421 0.51291056 1.62880065
H  -7.54077209 -2.17427502 0.03915912
H  -6.93775378 -4.41229327 -0.84299397
H  -4.53651459 -5.0313882 -1.13378643
H  -2.75382283 -3.41075974 -0.54194834
H  2.75397686 -3.41095136 0.54192282
H  4.53672624 -5.03167939 1.13328368
H  6.93793128 -4.41264061 0.84208203
H  7.54085147 -2.1745645 -0.03999374
H  -0.27166872 5.11663229 -2.87368239
H  -2.66566994 4.4698434 -2.965946
H  -3.34022264 2.13476587 -2.36640394
H  -1.66481344 0.51284291 -1.62803201
