program: Gaussian 16
title: int 2
version: ES64L-G16RevA.03
frameworkgroup: C1[X(C66H36Ni)]
method: RwB97XD
basis: def2SVP
operation: Freq
keyword: #P
keyword: Geom=AllCheck
keyword: Guess=TCheck
keyword: SCRF=Check
keyword: GenChk
keyword: RwB97XD/def2SVP
keyword: Freq
converged: YES YES YES YES
title: Mulliken charges:
elementType: C C C C C C C C C C C C C C C C C C C C C C C C C C C C C C C C C C C C C C C C C C C C C C C C C C C C C C C C C C C C C C C C C C H H H H H H H H H H H H H H H H H H H H H H H H H H H H H H H H H H H H Ni
charge: 0.058260 0.038415 -0.060980 0.026143 0.011014 0.015821 -0.124028 -0.109596 0.029546 -0.101617 0.078012 -0.123128 0.066430 0.019672 -0.085774 0.070629 0.045776 0.085506 -0.060602 0.023941 0.024085 -0.003676 -0.054042 -0.054717 -0.009900 -0.015170 0.046493 0.013584 0.078165 0.028501 0.023485 0.073341 -0.066649 0.023251 0.012032 0.074784 -0.060787 -0.008131 0.023825 -0.061180 -0.008583 0.013990 -0.000778 -0.044155 -0.020926 -0.004164 -0.042791 0.002244 -0.016872 0.000123 -0.010997 -0.036385 0.003143 -0.007814 -0.042124 -0.032353 -0.045938 -0.050057 -0.000448 0.004552 0.002779 -0.012498 -0.023815 -0.045001 -0.003704 0.000159 0.001577 0.017694 0.018303 0.019780 0.015503 0.020598 0.018086 0.003079 0.002580 0.016182 0.016271 0.018358 0.019914 0.025072 0.020660 0.004902 0.006927 0.022188 0.021148 0.023905 0.000330 0.016670 0.017832 0.004660 0.001838 0.001179 -0.000863 0.001616 0.006694 0.002466 0.006824 0.008234 0.001053 -0.000479 0.000574 0.002836 0.047488
chargesum: -0.00000
title: Mulliken charges with hydrogens summed into heavy atoms:
elementType: C C C C C C C C C C C C C C C C C C C C C C C C C C C C C C C C C C C C C C C C C C C C C C C C C C C C C C C C C C C C C C C C C C Ni
charge: 0.058260 0.038415 -0.060980 0.026143 0.011014 0.015821 -0.124028 -0.109596 0.029546 -0.101617 0.078012 -0.123128 0.066430 0.019672 -0.085774 0.070629 0.045776 0.085506 -0.058136 0.023941 0.024085 0.003018 -0.054906 -0.053538 -0.008062 -0.013554 0.046493 0.013584 0.078165 0.028501 0.023485 0.073341 -0.059825 0.023251 0.020266 0.074784 -0.061265 -0.007077 0.023825 -0.060607 -0.005747 0.013990 -0.000449 -0.039496 -0.004256 0.013669 -0.035864 0.023392 0.007033 0.022311 0.008917 -0.031483 0.023803 0.017258 -0.039544 -0.013995 -0.044361 -0.030277 0.017246 0.022854 0.019050 0.003684 -0.008312 -0.041922 0.014382 0.020757 0.047488
chargesum: 0.00000
polarizability: 9.77830818e+02 -4.02358379e+00 9.73755080e+02 1.67038633e+01 -2.19010022e+00 4.51946698e+02
1716.lowfreq: -102.5429 -0.8964 0.0029 0.0032 0.0036 1.9106 3.3430 18.6434 18.9962
redmass: 12.5073 6.3244 6.0598 5.9824 5.8824 6.0085 5.5708 5.4157 4.9495 5.4739 4.5732 5.1665 5.6019 5.3799 4.9771 5.5539 4.8512 4.9353 5.3151 5.7021 6.5336 4.9852 4.3839 4.3805 5.0465 4.5488 4.5964 4.3885 4.5832 4.7485 5.5172 5.4201 4.9647 5.5508 6.5946 6.7021 5.9820 6.3165 5.7633 5.7429 6.1338 5.9875 6.4729 5.5361 5.5438 6.7980 5.1686 6.0826 3.5516 3.5956 3.7482 4.7279 3.8532 4.2830 3.8159 3.9500 4.0401 5.5093 5.7405 5.4673 5.5749 7.2167 4.4913 6.7950 3.9992 3.9473 3.9839 4.7445 6.3793 6.1366 6.8158 7.0706 6.5490 4.1222 6.8611 3.7883 3.4357 3.3486 3.6074 3.6533 3.8451 5.8685 4.9322 4.9068 3.8440 6.8079 7.5860 6.5517 5.7203 4.2989 6.6952 5.9014 6.4338 5.3601 4.6705 4.1333 3.7628 4.9581 4.7140 2.2097 2.8121 3.0973 5.3273 2.0913 1.9510 1.3126 1.2791 1.3711 1.3602 1.3726 6.4281 6.1619 5.6851 5.7841 2.3121 2.1198 1.8462 1.8302 1.8525 1.8215 1.8496 1.9886 1.9792 4.9790 5.8414 5.3526 5.2160 5.2208 3.4534 2.7285 2.7228 5.6652 4.5861 1.8421 1.8022 2.0673 1.6648 2.0723 2.2720 5.6949 5.1114 5.0741 4.9328 1.4871 1.8089 1.3927 1.3641 1.9654 1.3721 1.5037 1.4168 1.4176 1.4088 1.3726 1.3765 1.3852 1.3485 1.3585 1.3702 1.3595 1.3525 1.3785 2.2660 2.0425 2.1405 2.4500 2.0640 2.1336 3.3402 3.0272 2.9863 3.1923 2.9231 2.4859 1.6534 1.5853 1.4729 1.2771 1.3142 1.2778 1.2168 1.3766 1.3861 1.2144 1.1675 1.2563 1.2063 1.1973 1.4183 1.3774 1.5636 2.0227 1.9493 1.9782 2.0053 1.9959 2.0619 1.9148 1.7882 1.7731 1.7941 1.8083 1.8100 1.8922 1.9918 2.0491 2.0711 2.3549 2.3563 2.4329 4.4793 3.9016 4.4679 5.1538 4.7602 5.3054 5.4755 7.0447 6.9488 5.3170 4.5508 4.2807 5.0954 3.3312 6.1150 3.7346 2.4581 2.5900 2.3160 2.2585 2.4663 2.3731 2.5614 2.9232 3.7831 3.6185 5.0985 3.5328 3.5288 4.6253 4.2123 3.7034 3.6699 4.2158 4.4901 5.3096 5.2027 5.7094 6.0628 7.6730 7.7799 7.9824 8.3440 9.0432 6.7620 6.5944 6.6310 6.4404 6.4883 6.5246 6.7895 6.7787 6.8894 7.0647 7.0396 7.0393 11.6345 1.0883 1.0875 1.0878 1.0877 1.0907 1.0900 1.0880 1.0908 1.0883 1.0914 1.0908 1.0917 1.0912 1.0926 1.0927 1.0922 1.0930 1.0923 1.0956 1.0983 1.0992 1.0984 1.0972 1.0988 1.0986 1.0962 1.0961 1.0965 1.0968 1.0911 1.0940 1.0935 1.0913 1.0907 1.0935 1.0922
irintensity: 23.9954 0.0357 0.0471 0.0771 0.1745 0.5944 0.1932 0.2668 0.0920 0.0532 0.0667 0.0581 0.2711 0.1385 0.1470 0.1657 0.6102 0.1053 3.4680 2.6051 0.5207 1.3588 0.1772 1.7039 0.7836 4.7066 1.4079 0.6228 1.4971 0.5672 1.3294 3.0521 1.9995 0.7142 2.8347 0.7103 0.7604 0.5014 0.9249 1.4769 4.9559 0.7987 6.1246 1.2864 3.0732 4.9754 3.3130 0.2907 0.9926 1.7448 1.7633 0.1913 3.2598 1.7412 4.1976 0.4591 6.4784 1.7071 11.6372 6.9188 6.7886 1.0885 9.7330 0.9756 0.7445 0.0652 1.1635 3.0343 0.6533 1.0335 1.6597 2.6244 0.8959 5.7701 2.5051 1.0125 0.7375 0.2905 0.7464 0.7539 19.6737 11.4536 21.7330 23.1668 4.8494 4.1701 8.1704 1.1765 12.2675 6.5085 1.9755 0.7468 16.9160 3.0015 9.2864 26.6220 3.3749 9.0749 8.9969 0.5439 1.2798 1.7522 3.8104 9.9011 9.1579 1.4536 61.7517 7.4715 2.8038 5.1562 1.3810 3.1355 3.6034 0.4899 45.2651 33.4942 47.1949 27.1231 1.9961 17.7906 5.6535 23.7639 8.7602 28.0132 27.9966 1.5863 5.3779 10.3233 0.7282 0.2500 0.9319 11.0002 0.4555 1.7154 2.8089 0.5564 1.4911 0.9753 1.0249 22.5275 4.7548 3.3989 3.6964 1.1942 1.0618 0.3060 0.4564 1.7213 0.8152 0.4010 0.1127 0.1063 0.4628 0.1155 1.6924 1.5254 0.3518 0.8548 0.0753 0.5927 1.1497 0.7869 7.2891 2.4110 5.1084 7.1248 2.1390 0.6940 9.2509 0.7874 0.8591 3.1253 4.4356 3.8015 1.8579 0.8129 12.7883 7.4014 9.6969 2.8980 2.2799 2.0883 3.2026 2.7357 0.6216 0.5973 1.4142 1.4560 0.1991 1.4645 2.3286 4.2390 6.1096 7.7570 4.0546 9.4174 12.1030 17.5832 5.0736 15.8364 11.3616 11.3671 4.2714 0.6579 28.4807 21.8204 10.0947 16.7536 3.3211 5.5823 2.8137 5.0747 2.7461 3.9853 3.3231 4.8461 13.9798 0.8204 0.8914 13.5537 1.3690 25.4563 10.8541 4.0658 1.4827 30.0477 2.0246 7.3396 0.8035 4.2826 14.9749 8.2169 4.5451 3.5972 2.4137 0.6581 0.6986 10.9942 2.5600 8.9939 3.7626 5.2026 2.1933 3.2993 27.9921 1.3417 17.8510 5.0628 4.7299 20.5733 0.6438 8.5968 1.3284 0.7809 4.4396 0.1715 15.3302 2.9988 3.0510 3.2535 3.0203 0.7278 1.6598 2.4303 0.5271 0.5709 101.4124 1.6739 1.3926 1.9080 1.5792 8.6531 2.5876 1.2641 11.3557 2.0542 8.2087 2.0178 8.3132 9.0309 12.4195 16.0373 12.0503 12.1914 7.6552 17.6192 17.3087 20.9949 19.4665 11.9721 15.1825 6.1108 0.5725 0.6959 0.2900 2.6088 25.3754 2.0268 3.1084 14.3120 22.0153 4.5842 0.9992
temp: 298.150 k
press: 1.00000 atm
elementType: 6 6 6 6 6 6 6 6 6 6 6 6 6 6 6 6 6 6 6 6 6 6 6 6 6 6 6 6 6 6 6 6 6 6 6 6 6 6 6 6 6 6 6 6 6 6 6 6 6 6 6 6 6 6 6 6 6 6 6 6 6 6 6 6 6 6 1 1 1 1 1 1 1 1 1 1 1 1 1 1 1 1 1 1 1 1 1 1 1 1 1 1 1 1 1 1 1 1 1 1 1 1 28
symmnumber: 1
zpe: 2129554.0 jmol-1
zpe.correction: 0.811104 hartree
zpe.thermalcorrener: 0.856868 hartree
zpe.thermalcorrenthalpy: 0.857813 hartree
zpe.thermalcorrgfe: 0.733411 hartree
zpe.sumelectzpe: -4041.435040 hartree
zpe.sumelectthermal: -4041.389276 hartree
zpe.sumelectthermalent: -4041.388331 hartree
zpe.sumelectthermalfe: -4041.512733 hartree
dipole: -0.1334 -3.3107 0.8906
dipole: 3.4310
quadrupole: -341.0837 -338.9940 -397.6070
quadrupole: -2.9991 7.1010 1.8814
quadrupole: 18.1445 20.2343 -38.3788 -2.9991 7.1010 1.8814
hfenergy: -4042.246144 hartree
pointgroup: C01 [X(C66H36Ni1)]
dipole: -1.0993029 -0.2668252 0.7365341 debye
polarizability: 908.9770093|63.4033056|923.2605885|-159.812361|150.1010649|571.2949985 unknown
InChI: InChI=1S/C44H24.C22H12.Ni/c1-5-13-31-27(9-1)17-21-35-37-23-19-29-11-3-7-15-33(29)43(37)41(25-39(31)35)42-26-40-32-14-6-2-10-28(32)18-22-36(40)38-24-20-30-12-4-8-16-34(30)44(38)42;1-3-7-17-15(5-1)9-11-21-19(17)13-14-20-18-8-4-2-6-16(18)10-12-22(20)21;/h1-24H;1-12H;
charge 0 multiplicity 1
103 atoms
C  0.02708403 -4.0043514 -2.14503664
C  1.47006739 -3.79975344 -2.06754933
C  -0.87752253 -2.94300477 -1.89008038
C  -0.24915783 -1.72838299 -1.54336111
C  1.0388211 -1.56845853 -1.4036087
C  -1.1200423 -0.20288665 0.59854289
C  -0.98107186 1.16367067 0.60519116
C  0.44964077 1.76894309 0.61127489
C  1.22401633 1.50205095 -0.48763571
C  2.01824634 -2.55628842 -1.65058419
C  0.88610496 2.63048951 1.6797762
C  2.443109 2.19088879 -0.71108542
C  2.84287896 3.16246309 0.23258259
C  2.03064744 3.4128817 1.40672631
C  -2.20394364 -0.94211952 1.09868276
C  -3.35322273 -0.17435433 1.3908666
C  -3.32448836 1.27500098 1.27373889
C  -2.18017334 1.95683075 0.8025976
C  -4.44380187 2.04902455 1.72608053
C  -2.20967689 3.40023937 0.64954221
C  -3.31560308 4.12364843 1.16915057
C  -4.41851273 3.40689034 1.72486135
C  4.09065978 3.84385454 0.02796111
C  2.33414612 4.50670369 2.2867908
C  1.56164336 4.79412215 3.36558975
C  4.89069139 3.56108941 -1.03479223
C  3.25433574 1.94998916 -1.89410173
C  4.50048686 2.61067141 -2.03085866
C  3.43732204 -2.38529974 -1.47506603
C  0.18886672 2.80079181 2.94561377
C  0.4854292 3.93373312 3.7480621
C  -2.19269671 -2.37879358 1.26496702
C  -4.55525448 -0.88826661 1.71306267
C  -3.41264916 -3.03776951 1.55002545
C  -4.58771118 -2.24883473 1.75323954
C  -2.30268848 -3.13590497 -1.94486241
C  -0.5417016 -5.29560728 -2.40762855
C  -1.88761813 -5.50857565 -2.37144836
C  -2.81230302 -4.44147986 -2.1376854
C  2.39772479 -4.84566327 -2.39418955
C  3.74581046 -4.6681383 -2.3041372
C  4.31116796 -3.44058999 -1.83330683
C  -0.74573491 1.86599442 3.4596409
C  -0.2412991 4.16792451 4.93931983
C  -1.43000909 2.1021435 4.6330396
C  -1.20144029 3.27975942 5.3687145
C  -3.33735968 5.53683209 1.09221292
C  -1.20767531 4.13529194 -0.03608132
C  -1.25590719 5.50994048 -0.11144672
C  -2.31609492 6.22463749 0.47878497
C  -1.01083246 -3.14680616 1.16692512
C  -3.43988623 -4.44877318 1.63188306
C  -2.28314634 -5.1808786 1.47552634
C  -1.05743976 -4.52125384 1.26267293
C  -4.21264483 -4.64763805 -2.10309689
C  -3.20621015 -2.05967387 -1.78579432
C  5.32706365 2.32784476 -3.14483563
C  2.84799942 1.0684911 -2.92356371
C  4.92260273 1.43452075 -4.11175124
C  3.66363318 0.81152958 -4.00361506
C  -4.56537156 -2.28088227 -1.76746615
C  -5.07362679 -3.58915795 -1.91163821
C  3.97851131 -1.1921179 -0.94569623
C  5.70867206 -3.25193461 -1.70432982
C  6.21480372 -2.06482049 -1.22080439
C  5.34085982 -1.0295535 -0.82742011
H  6.29181208 2.83510316 -3.2271186
H  5.56807871 1.21829374 -4.96570903
H  3.3318778 0.11598336 -4.77722751
H  1.87913877 0.57879191 -2.84203986
H  3.29867978 -0.40328752 -0.626932
H  5.74072765 -0.09479068 -0.42877865
H  7.29455712 -1.92800307 -1.12939467
H  6.38066433 -4.06467928 -1.99149383
H  -4.60140775 -5.66027266 -2.23725696
H  -6.15239476 -3.75852891 -1.88768355
H  -5.25099533 -1.44080752 -1.63945135
H  -2.80880563 -1.04915533 -1.6789749
H  -0.05605699 -2.6476904 1.0023138
H  -0.13676311 -5.09927489 1.16303662
H  -2.31126211 -6.27086873 1.53207033
H  -4.39198713 -4.94814645 1.82584645
H  -4.18999919 6.0714396 1.51791035
H  -2.33962562 7.31498474 0.42435208
H  -0.39524473 3.61366347 -0.5354174
H  -0.46680157 6.0442848 -0.64400611
H  -0.90844865 0.91996748 2.94944745
H  -2.14263445 1.35901881 4.9967867
H  -1.75582958 3.46801811 6.29050872
H  -0.0107566 5.06106692 5.52547797
H  1.78260175 5.66665567 3.98487905
H  3.17234739 5.16326315 2.05933007
H  4.43789301 4.5762196 0.75540818
H  5.85144132 4.07045562 -1.14541284
H  -5.26383697 3.97174812 2.12465483
H  -5.3181973 1.54624257 2.1352096
H  -5.48087098 -0.34192831 1.88620544
H  -5.52982405 -2.76250537 1.95931327
H  -2.28251965 -6.51426105 -2.53592649
H  0.11119411 -6.14581498 -2.60371227
H  2.02478542 -5.80625466 -2.74889186
H  4.42073224 -5.48068711 -2.58458881
Ni 0.13012265 -0.08066835 -0.71182963
