program: Gaussian 16
title: OPT
version: ES64L-G16RevA.03
frameworkgroup: C1[X(C66H36Ni)]
method: RwB97XD
basis: def2SVP
operation: Freq
keyword: #P
keyword: Geom=AllCheck
keyword: Guess=TCheck
keyword: SCRF=Check
keyword: GenChk
keyword: RwB97XD/def2SVP
keyword: Freq
converged: YES YES NO YES
title: Mulliken charges:
elementType: C C C C H C C H C C C C H C C H C H C H C C C H C H C H C H C H C H Ni C C C C H C C H C C C C H C C H C H C H C C C H C H C H C H C H C H C C C C H C C H C C C C H C C H C H C H C C C H C H C H C H C H C H
charge: 0.036597 -0.071300 0.081892 -0.010498 0.017686 0.016317 -0.009019 0.017236 0.017803 -0.064036 0.051167 -0.032886 0.002157 0.060844 0.004605 0.001795 -0.003458 0.018975 -0.071661 0.000110 0.021394 0.076007 -0.066332 -0.001138 0.001315 0.002712 -0.004565 0.016901 -0.002675 0.018862 -0.011394 0.014093 -0.036595 0.002214 -0.162762 -0.020513 -0.083801 0.098534 -0.005237 -0.013979 0.100349 -0.011360 0.015647 0.009856 -0.107700 0.050908 -0.031709 0.001928 0.050972 0.001651 0.001046 0.006331 0.011553 -0.064760 0.000477 0.009906 0.091151 -0.059199 -0.000518 -0.006681 0.003352 -0.007942 0.018984 0.007324 0.020867 -0.035482 -0.003675 -0.040376 0.004202 0.101853 -0.098033 0.059011 -0.048315 0.020115 0.017365 -0.005433 0.021823 0.018786 -0.068230 0.042655 -0.048378 0.006623 0.046128 -0.009660 0.004465 -0.002988 0.022733 -0.055725 0.002439 0.012832 0.098082 -0.061706 0.000656 -0.003302 0.002219 -0.007196 0.017654 0.001471 0.014747 -0.028652 0.015183 -0.037009 0.003323
chargesum: -0.00000
title: Mulliken charges with hydrogens summed into heavy atoms:
elementType: C C C C C C C C C C C C C C C C C C C C C C Ni C C C C C C C C C C C C C C C C C C C C C C C C C C C C C C C C C C C C C C C C C C C C
charge: 0.036597 -0.071300 0.081892 0.007188 0.016317 0.008217 0.017803 -0.064036 0.051167 -0.030728 0.060844 0.006400 0.015516 -0.071551 0.021394 0.076007 -0.067470 0.004028 0.012336 0.016187 0.002699 -0.034381 -0.162762 -0.020513 -0.083801 0.098534 -0.019216 0.100349 0.004287 0.009856 -0.107700 0.050908 -0.029781 0.050972 0.002697 0.017884 -0.064283 0.009906 0.091151 -0.059718 -0.003329 0.011043 0.028191 -0.039157 -0.036174 0.101853 -0.098033 0.059011 -0.028200 0.017365 0.016390 0.018786 -0.068230 0.042655 -0.041755 0.046128 -0.005195 0.019744 -0.053286 0.012832 0.098082 -0.061050 -0.001083 0.010458 0.016218 -0.013469 -0.033686
chargesum: 0.00000
polarizability: 9.91267055e+02 3.23034147e+01 9.52810192e+02 -1.37263908e+01 -7.62737374e+01 4.02517935e+02
1716.lowfreq: -3.1567 -0.0015 0.0017 0.0049 3.6547 4.1863 14.1862 21.0463 27.0896
redmass: 6.1974 6.2630 6.2530 6.7126 5.6788 5.2005 5.5797 5.3393 6.1920 5.9755 5.5358 5.7131 5.1176 4.9932 4.8678 5.3097 5.1888 5.0649 5.5149 5.5968 5.9769 6.4919 6.3569 4.3486 4.4574 5.0235 4.9109 5.0449 3.9898 4.6565 4.6245 5.7228 5.3659 5.1407 7.1632 6.3362 6.9465 5.4090 5.4660 5.5044 4.9121 5.2926 5.9764 8.6743 6.1025 6.3969 5.9793 8.0898 3.5517 3.7170 3.8376 3.9777 4.1051 3.8791 4.4097 3.6257 3.7506 5.1325 5.5334 4.9477 5.0014 5.3344 5.5671 6.1301 8.3826 8.2024 3.8138 3.6940 3.7492 7.1528 6.8932 7.0690 7.0308 7.1565 6.6549 3.4754 3.3399 3.3422 3.4605 3.3374 3.3910 5.9169 6.3533 6.0167 3.8722 3.9492 3.9690 8.0340 7.9161 7.6331 7.2276 7.2779 7.2670 6.7691 6.4923 5.7694 3.9352 4.0987 4.1118 2.1616 2.1702 2.2142 5.6779 5.6440 4.7320 1.3041 1.3329 1.2947 5.3728 1.5970 1.3958 1.4008 3.9545 6.0656 2.3120 2.2046 2.1520 2.2114 2.5011 2.1548 2.5608 3.4770 1.7881 1.8266 1.9323 4.6734 5.2335 5.3000 5.2101 3.0800 3.0954 2.8812 4.6263 4.1737 4.4256 2.0215 1.8374 1.9199 1.8716 1.9791 1.8541 4.9774 4.8591 4.8973 1.3722 1.3673 1.3739 1.3645 1.3386 1.3622 1.4074 1.4153 1.4124 1.3726 1.3701 1.3763 1.3691 1.3467 1.3560 1.3355 1.3391 1.3474 2.2834 2.2796 2.3020 2.0085 2.0110 2.0186 3.7368 3.6622 3.0206 3.0346 2.9413 3.1280 1.7266 1.6907 1.6582 1.2908 1.2723 1.2342 1.2213 1.2470 1.1937 1.2220 1.2055 1.3709 1.1545 1.2606 1.2564 1.4397 1.5469 1.4470 1.8836 1.8995 1.9008 2.1180 2.0921 2.1322 1.9167 1.8830 1.9055 1.8177 1.8227 1.8336 2.0715 2.0305 2.0580 2.2187 2.2115 2.3076 4.0203 4.1815 4.2953 4.6432 4.5603 4.6672 7.1519 6.9118 6.8368 7.2815 5.7714 3.2581 4.1364 4.3219 2.8122 2.5935 2.5624 2.4644 2.4586 2.4386 2.3436 2.3729 2.5277 2.5213 4.4062 5.0197 5.3096 4.6361 4.6610 4.7347 3.8725 3.8675 3.8025 5.1419 5.0874 5.5514 6.0901 6.1606 6.2645 7.5446 7.6498 7.7318 6.7393 6.6041 6.7601 6.6524 6.7727 6.6006 6.8026 6.7553 6.7993 7.0610 7.0341 7.0480 11.8385 11.8701 11.8826 1.0879 1.0878 1.0876 1.0875 1.0876 1.0875 1.0901 1.0901 1.0899 1.0912 1.0909 1.0910 1.0926 1.0898 1.0913 1.0911 1.0912 1.0916 1.0961 1.0958 1.0959 1.0989 1.0959 1.0970 1.1003 1.0966 1.0967 1.0993 1.0986 1.0964 1.0986 1.0967 1.0918 1.0917 1.0915 1.0925
irintensity: 0.0884 0.0162 0.0882 0.7154 0.1158 0.1697 0.1033 0.2398 0.4086 0.1271 0.0762 0.0380 0.3020 0.2320 0.1217 0.1235 0.2076 0.0455 1.0383 2.2895 1.1727 0.2182 0.1566 0.3323 0.3885 0.7338 0.7442 1.1427 0.3411 1.8175 0.2408 1.5220 0.3314 0.1384 0.5024 0.8008 0.2528 0.1144 1.1552 1.7349 0.9971 3.6086 6.4021 5.1072 2.2517 3.1894 0.5041 4.5423 0.5491 0.1322 2.6145 0.5449 3.3497 3.6910 1.6682 2.2018 11.5867 1.3453 2.8740 9.9252 0.8307 11.8674 8.9416 1.3508 0.0786 0.5198 1.3561 0.6632 0.2911 6.8075 5.5403 1.2853 7.4557 6.8854 5.5423 1.4181 0.4503 0.1470 29.6097 3.2898 0.1967 0.8016 17.5275 14.1645 13.4699 9.1031 3.8836 32.6512 27.4963 0.5057 0.6232 0.5383 0.7740 6.8004 27.5582 20.6104 7.7319 7.7325 17.1644 2.1009 1.9432 2.5433 27.4190 20.9929 0.6664 8.7580 3.8456 79.1300 13.7071 0.4879 0.4454 4.8333 3.7486 0.8903 88.5115 1.3152 31.9380 10.0170 2.0854 11.7997 17.6875 10.7759 73.6852 24.1258 5.6066 19.0398 21.9063 14.5043 1.6695 0.2682 1.8157 1.3504 3.2536 2.5078 0.7956 0.2637 0.3635 0.3388 1.0994 1.2300 1.2777 5.3556 3.7994 1.3478 0.3329 1.0815 0.0165 0.9336 3.1563 0.3169 0.0984 0.2155 0.0323 0.3399 2.7510 0.4489 0.0188 0.5067 0.2070 0.6123 0.7455 0.4960 2.4343 3.6912 12.1563 2.2336 2.9302 0.4857 2.1587 1.9368 3.5152 1.9685 1.2606 7.5636 0.5742 4.3715 2.5294 1.9834 4.1665 1.3773 2.7745 1.5093 0.0538 0.9133 1.5986 3.2720 1.8335 2.6051 3.5458 3.7172 5.7231 3.7061 2.9183 9.7000 8.4987 12.9567 7.2907 1.3182 14.2562 2.0636 2.6339 13.0014 3.5795 7.0596 26.4274 21.2102 2.1292 6.8911 6.3937 3.6208 3.2758 3.7747 5.5674 1.7120 2.2610 5.2112 3.5924 3.1509 3.6182 0.5333 4.6372 5.1255 5.7865 0.9135 1.0353 11.4475 6.0852 4.8349 6.6427 9.2412 11.5544 2.0882 1.2477 22.1136 0.9772 0.8991 0.1105 13.5368 9.7499 16.1822 4.8623 2.5125 1.3325 3.9733 3.6746 2.5454 1.5941 2.0214 3.4565 0.3038 0.8663 0.4040 5.4824 0.5647 6.0996 0.6024 1.9425 0.6359 0.3316 0.1491 0.1811 0.3695 1.6852 3.1616 17.6885 133.2995 165.6271 1.5113 2.2726 0.8644 1.2326 1.3837 0.5400 4.0900 2.3871 2.0053 8.4936 9.2366 9.9827 12.5478 2.4804 11.6325 2.1212 9.9028 9.5239 16.5641 4.0523 24.7067 24.0985 11.6198 20.1030 12.9652 0.5257 0.3988 4.8772 6.1946 0.2913 4.7304 4.2867 21.2497 21.3132 17.5316 2.1555
temp: 298.150 k
press: 1.00000 atm
elementType: 6 6 6 6 1 6 6 1 6 6 6 6 1 6 6 1 6 1 6 1 6 6 6 1 6 1 6 1 6 1 6 1 6 1 28 6 6 6 6 1 6 6 1 6 6 6 6 1 6 6 1 6 1 6 1 6 6 6 1 6 1 6 1 6 1 6 1 6 1 6 6 6 6 1 6 6 1 6 6 6 6 1 6 6 1 6 1 6 1 6 6 6 1 6 1 6 1 6 1 6 1 6 1
symmnumber: 1
zpe: 2123505.8 jmol-1
zpe.correction: 0.808801 hartree
zpe.thermalcorrener: 0.856001 hartree
zpe.thermalcorrenthalpy: 0.856945 hartree
zpe.thermalcorrgfe: 0.730133 hartree
zpe.sumelectzpe: -4041.400244 hartree
zpe.sumelectthermal: -4041.353043 hartree
zpe.sumelectthermalent: -4041.352099 hartree
zpe.sumelectthermalfe: -4041.478911 hartree
dipole: -0.7876 -1.5443 0.1202
dipole: 1.7377
quadrupole: -331.1352 -340.2312 -404.4320
quadrupole: -0.7408 -0.4223 -12.1711
quadrupole: 27.4643 18.3682 -45.8325 -0.7408 -0.4223 -12.1711
hfenergy: -4042.2090442 hartree
pointgroup: C01 [X(C66H36Ni1)]
dipole: -0.2981277 -0.613777 0.0423737 debye
polarizability: 989.9146284|32.8211325|955.5413398|-14.5155866|-71.0590876|401.1392131 unknown
InChI: InChI=1S/3C22H12.Ni/c3*1-3-7-17-15(5-1)9-11-21-19(17)13-14-20-18-8-4-2-6-16(18)10-12-22(20)21;/h3*1-12H;
charge 0 multiplicity 1
103 atoms
C  -1.21631806 -0.63970245 -1.19989886
C  -2.49751043 -1.17151754 -1.50046474
C  -3.68744938 -0.40269995 -1.73682923
C  -3.65555119 1.00508214 -1.87698507
H  -2.69283531 1.51775022 -1.86030955
C  -0.11613685 -1.32109414 -1.15032236
C  -6.06672511 1.05637324 -2.05814489
H  -6.9870554 1.63397247 -2.16775945
C  -4.93167485 -1.0741321 -1.81986692
C  -0.01895564 -2.72801541 -1.3164955
C  -1.28211892 -3.36617097 -1.38431178
C  -6.11906294 -0.31601883 -1.96701618
H  -7.07731615 -0.8392301 -2.01185677
C  -2.51549298 -2.58889518 -1.51856497
C  -4.94365921 -2.50112119 -1.76673265
H  -5.90338145 -3.0180245 -1.84293498
C  -4.82180274 1.72056895 -2.02835365
H  -4.78267206 2.80747056 -2.12302063
C  -3.79136664 -3.22322334 -1.65935426
H  -3.85823364 -4.31064638 -1.67127121
C  1.13767985 -4.89244504 -1.18550906
C  1.20357057 -3.48372062 -1.31910252
C  -1.29666299 -4.79655889 -1.2942937
H  -2.24620597 -5.33097299 -1.30307225
C  -0.14688628 -5.51764435 -1.15947165
H  -0.19650129 -6.60424464 -1.0547996
C  3.56060382 -5.00562562 -1.18031835
H  4.48299445 -5.58608871 -1.11053844
C  3.62424561 -3.60975354 -1.37419161
H  4.59345161 -3.11474445 -1.46193203
C  2.4690294 -2.86386236 -1.44302127
H  2.51897401 -1.78449792 -1.59510101
C  2.3393891 -5.63629089 -1.09775058
H  2.2818027 -6.720188 -0.97175534
Ni 0.16939617 0.36347296 -0.29850857
C  -1.35349906 1.23299764 0.54930834
C  -2.68178982 1.44683205 0.97521321
C  -3.65217656 0.43418975 1.29327639
C  -3.30578853 -0.93204606 1.40593634
H  -2.26164691 -1.22334724 1.293981
C  -0.41727659 2.10704851 0.40296361
C  -5.61903512 -1.50576029 1.80917719
H  -6.37895006 -2.26800462 1.99387918
C  -4.9968668 0.82038781 1.50870672
C  -0.59650422 3.48223886 0.71313401
C  -1.94868348 3.84170216 0.9600743
C  -5.97364806 -0.17664583 1.74626499
H  -7.01334567 0.127235 1.89024717
C  -2.98918689 2.8273267 1.0906874
C  -5.31829132 2.2134736 1.50596349
H  -6.3571441 2.50966967 1.67028461
C  -4.26897025 -1.88371234 1.65596287
H  -3.98578097 -2.93541241 1.73196497
C  -4.35696582 3.167699 1.3531597
H  -4.65191211 4.21467425 1.41526222
C  0.11086099 5.83869555 0.91434167
C  0.44896401 4.47168746 0.75616468
C  -2.24172471 5.23869575 1.11359201
H  -3.27079739 5.56068433 1.27005794
C  -1.26692545 6.18932149 1.07148888
H  -1.52958902 7.24392451 1.18580952
C  2.46481912 6.42809661 0.82742458
H  3.25374786 7.1831702 0.84523223
C  2.80180527 5.06398241 0.70775276
H  3.84842636 4.76025104 0.6307195
C  1.81070106 4.10792098 0.67900187
H  2.0631492 3.05098019 0.6113403
C  1.1438431 6.80663604 0.93651188
H  0.87752272 7.86061942 1.04952135
C  2.11409182 0.57449848 -0.06977039
C  3.48368742 0.88200473 -0.2195689
C  4.01221145 1.93863627 -1.04600277
C  3.17273602 2.73776743 -1.85527966
H  2.09816133 2.54319175 -1.85370942
C  1.68776865 -0.42497574 0.61016739
C  5.08464905 4.00652157 -2.61422297
H  5.4928087 4.81729438 -3.22147616
C  5.40913353 2.17027059 -1.06032573
C  2.42537953 -1.43366839 1.24309127
C  3.82319835 -1.17569077 1.18224356
C  5.92495742 3.22683074 -1.84861675
H  7.00256348 3.40900146 -1.8488691
C  4.34496414 -0.01164565 0.4814385
C  6.2561269 1.31139618 -0.28774732
H  7.33267749 1.49871588 -0.29222131
C  3.6979089 3.75188287 -2.62564117
H  3.03694934 4.36464749 -3.24153266
C  5.7537538 0.2646081 0.42362023
H  6.44934712 -0.36774708 0.97489542
C  2.79463244 -3.62939954 2.27430626
C  1.89415694 -2.63935327 1.81716773
C  4.68474653 -2.17402033 1.74976373
H  5.76343771 -2.01928772 1.75275873
C  4.1982919 -3.34688498 2.24347246
H  4.88924542 -4.10152216 2.62702313
C  0.9231155 -5.09601491 2.76000877
H  0.53769729 -6.05466361 3.11369035
C  0.02603731 -4.09327046 2.33701405
H  -1.050049 -4.27512167 2.36944477
C  0.50408909 -2.88471025 1.88161815
H  -0.18388644 -2.10530758 1.5523655
C  2.28124124 -4.8632125 2.74005139
H  2.97958263 -5.63142703 3.08108159
