program: Gaussian 09
title: 000041866
version: EM64L-G09RevD.01
frameworkgroup: C1[X(C13H14N2O3)]
method: RPBEPBE
basis: SDD
operation: Freq
keyword: #p
keyword: freq=noraman
keyword: PBEPBE/SDD
title: #p freq=noraman PBEPBE/SDD
converged: YES YES NO NO
title: Mulliken charges:
elementType: O O O N N C C C C C C C C C C C C C H H H H H H H H H H H H H H
charge: -0.190601 -0.190884 -0.216150 -0.380022 -0.379437 -0.058895 -0.445219 0.472717 -0.381920 0.157416 0.158092 -0.344814 -0.389974 -0.698506 0.156034 -0.247315 -0.241223 -0.236418 0.233327 0.233902 0.216003 0.215521 0.365315 0.365298 0.227092 0.254207 0.215225 0.215242 0.221568 0.230259 0.230184 0.233978
chargesum: 0.00000
title: Mulliken charges with hydrogens summed into heavy atoms:
elementType: O O O N N C C C C C C C C C C C C C
charge: -0.190601 -0.190884 -0.216150 -0.014708 -0.014139 -0.058895 0.022009 0.472717 0.049603 0.157416 0.158092 -0.117721 -0.135767 -0.046472 0.156034 -0.017056 -0.011039 -0.002440
polarizability: 1.76487919e+02 -1.19451237e+01 1.76644848e+02 -1.21894030e-03 1.98680619e-01 1.17984883e+02
1716.lowfreq: -0.0010 -0.0009 -0.0008 3.7801 7.8566 11.2995 12.0954 37.1526 67.6751
frequency: 7.6885 37.0870 67.6542 83.1453 94.1062 113.7407 140.0920 144.2270 177.1346 225.5106 243.7127 255.6424 286.6200 297.1231 307.2946 356.7722 378.4701 399.0726 478.4519 491.7367 492.7090 527.2837 603.5088 616.5290 629.7535 652.7923 679.7722 700.5868 703.3449 745.7484 747.7132 749.5050 775.6362 787.7454 844.5480 850.1441 881.4421 914.7377 931.1513 971.6811 979.0926 989.6585 992.4887 999.1361 1029.0525 1047.2057 1077.6231 1112.9642 1121.2342 1143.0954 1162.8060 1176.7423 1200.5326 1204.2676 1265.9551 1277.9381 1304.6031 1317.8451 1326.6661 1356.2546 1363.4914 1375.2195 1377.6048 1380.4499 1391.3897 1435.0447 1451.8484 1471.0658 1479.2754 1482.6946 1485.1664 1592.8045 1607.8280 1618.3217 1656.4958 1675.3681 2975.4445 2977.5922 3009.8543 3023.9815 3071.1894 3078.9666 3083.4250 3124.1664 3134.2740 3146.6521 3162.6189 3175.8337 3515.7820 3517.5858
redmass: 3.8187 9.0479 3.0088 3.9131 4.0166 2.2085 5.8439 10.3468 7.3130 1.7049 1.9827 5.6689 3.2995 2.5223 4.3038 12.0975 12.0625 2.7848 9.7486 3.6242 4.8052 6.6494 8.8297 6.4985 3.9902 2.5933 2.8088 1.6335 7.7934 1.4074 4.4605 1.3612 1.9485 1.6770 1.2654 1.5201 3.6716 1.4035 2.3060 1.5681 1.6063 4.6754 4.3516 1.3332 2.4928 3.3617 2.1308 2.4510 2.5616 2.2700 3.7409 1.0534 1.1221 4.3753 1.3327 2.2775 1.7446 1.1179 1.4234 1.5174 10.2494 2.0970 1.4264 6.1087 1.2207 2.1623 1.1070 1.0689 1.0417 1.8630 1.1395 6.0051 6.0625 7.1992 9.0269 5.3254 1.0571 1.0373 1.0586 1.1010 1.1017 1.0993 1.1042 1.0859 1.0875 1.0933 1.0972 1.0975 1.0756 1.0781
irintensity: 0.0671 0.8528 0.2271 0.3596 0.3300 0.0426 0.2986 9.5305 2.5467 0.6454 0.1039 4.6032 0.2660 2.3365 2.0674 27.0275 3.2532 0.0002 15.3974 11.1597 22.4343 11.8008 1.0650 0.3398 0.5657 3.9739 27.9585 54.3977 0.3574 6.4686 13.5164 2.7159 36.5596 223.3961 0.0005 0.0067 0.3855 0.0033 13.3892 0.1271 0.4678 5.2310 1.4425 0.0010 11.6180 2.4416 9.3769 1.5022 5.2080 0.8800 5.7983 0.3850 1.9554 42.8877 15.9653 206.2033 137.0489 1.7850 17.5392 6.5548 254.8288 2.2938 3.4019 1.4949 7.9745 7.5860 10.2689 1.7566 14.5335 35.8547 4.1226 2.1113 7.8944 304.7794 58.4480 618.5716 29.8752 26.7280 19.9242 6.3339 19.1545 41.4006 34.8342 5.0337 1.2091 22.8626 27.4151 9.4165 88.1383 45.0058
temp: 298.150 k
press: 1.00000 atm
elementType: 8 8 8 7 7 6 6 6 6 6 6 6 6 6 6 6 6 6 1 1 1 1 1 1 1 1 1 1 1 1 1 1
symmnumber: 1
zpe: 659849.4 jmol-1
zpe.correction: 0.251323 hartree
zpe.thermalcorrener: 0.267796 hartree
zpe.thermalcorrenthalpy: 0.268740 hartree
zpe.thermalcorrgfe: 0.205271 hartree
zpe.sumelectzpe: -837.699459 hartree
zpe.sumelectthermal: -837.682987 hartree
zpe.sumelectthermalent: -837.682043 hartree
zpe.sumelectthermalfe: -837.745511 hartree
dipole: -1.1642 0.7807 0.0018
dipole: 1.4017
quadrupole: -95.6268 -106.3760 -117.9865
quadrupole: 4.6633 -0.0156 0.0622
quadrupole: 11.0363 0.2871 -11.3234 4.6633 -0.0156 0.0622
hfenergy: -837.9507825 hartree
pointgroup: C01 [X(C13H14N2O3)]
dipole: 0.5088917 -0.2124654 0.0026174 debye
polarizability: 181.0379177|-11.0763339|172.0936097|0.3447243|-0.0069389|117.9861222 unknown
InChI: InChI=1S/C13H14N2O3/c1-2-8-13(9-6-4-3-5-7-9)10(16)14-12(18)15-11(13)17/h3-7,14-15H,2,8H2,1H3
charge 0 multiplicity 1
32 atoms
O  -0.627203 -0.340663 -2.442793
O  -0.647825 -0.370758 2.420428
O  -2.703011 3.019269 0.001003
N  -1.588362 1.342281 -1.18679
N  -1.596434 1.329046 1.177562
C  -0.242876 -0.437785 -0.01003
C  -0.509733 -1.973227 -0.020427
C  1.275696 -0.073691 -0.000574
C  -2.008119 -2.350595 -0.032633
C  -0.826307 0.162824 -1.310318
C  -0.837059 0.147028 1.29272
C  1.662018 1.292973 -0.000624
C  2.282889 -1.066886 0.009738
C  -2.204889 -3.881838 -0.039356
C  -2.00689 1.974131 -0.002411
C  3.024319 1.657344 0.009014
C  3.648075 -0.7013 0.019402
C  4.02532 0.659431 0.019112
H  -0.035038 -2.40549 0.878927
H  -0.022242 -2.39577 -0.917548
H  -2.499537 -1.919011 -0.9271
H  -2.512597 -1.925074 0.857524
H  -1.91703 1.773447 -2.057495
H  -1.930935 1.750411 2.050826
H  0.904737 2.086249 -0.008572
H  2.018193 -2.127064 0.010289
H  -1.735671 -4.338133 -0.930897
H  -1.751721 -4.344089 0.857391
H  -3.277429 -4.146842 -0.049863
H  3.303054 2.716769 0.008612
H  4.415634 -1.482939 0.027222
H  5.084273 0.939552 0.026661
