program: Gaussian 16
title: Title Card Required
version: ES64L-G16RevC.01
frameworkgroup: C1[X(C18H30O3Si)]
method: RM062X
basis: 6-31G(d,p)
operation: Freq
keyword: #P
keyword: Geom=AllCheck
keyword: Guess=TCheck
keyword: SCRF=Check
keyword: GenChk
keyword: RM062X/6-31G(d,p)Freq
converged: YES YES YES YES
title: Mulliken charges:
elementType: C C C C O C C O Si C C C C C H H H H H H H H H O C H H H C H H H C H H H C H H H C H H H C C H H H H H H
charge: 0.212966 -0.105224 -0.308176 0.062659 -0.463128 -0.148000 0.405051 -0.661859 0.972190 -0.231427 -0.216718 -0.016750 0.354998 -0.181025 0.157406 0.154726 0.159363 0.177147 0.157616 0.145966 0.156930 0.123033 0.147494 -0.643191 -0.347172 0.127891 0.121594 0.134015 -0.350550 0.125082 0.128216 0.121029 -0.341589 0.092758 0.106147 0.102373 -0.340353 0.091309 0.103809 0.107463 -0.351284 0.097660 0.109256 0.109230 -0.564957 -0.566536 0.132750 0.114049 0.141013 0.128775 0.141287 0.114689
chargesum: -0.00000
title: Mulliken charges with hydrogens summed into heavy atoms:
elementType: C C C C O C C O Si C C C C C O C C C C C C C
charge: 0.212966 0.052182 0.005912 0.239806 -0.463128 0.008930 0.405051 -0.661859 0.972190 0.072155 0.053809 -0.016750 0.354998 -0.181025 -0.643191 0.036329 0.023777 -0.040310 -0.037772 -0.035138 -0.180206 -0.178725
chargesum: 0.00000
polarizability: 3.15157358e+02 4.43386542e+00 2.81864255e+02 -8.76816010e+00 5.65004172e-01 2.09226425e+02
1716.lowfreq: -547.4376 -7.6124 -5.9378 -2.0853 -0.0017 -0.0013 -0.0011 34.9009 40.9519
frequency: -547.4375 34.8956 40.8857 67.0213 81.0647 103.9119 107.0250 118.2289 147.5060 165.1861 168.8240 172.6583 186.9312 220.1885 222.0349 231.2457 239.5387 249.4315 255.1181 270.6606 277.3646 282.4800 301.4145 304.2931 309.0974 318.2056 333.5901 335.4208 365.7306 382.4110 388.8376 405.9351 406.7221 417.7362 424.2241 444.2017 483.8279 499.6485 510.5110 540.0042 550.2400 574.9286 591.0634 627.8329 656.2603 685.1551 709.5872 745.9977 787.5646 792.7402 793.0745 814.8288 825.0143 832.5865 838.1940 847.0215 858.8689 878.5726 892.9361 914.1100 922.7052 940.0048 956.1720 964.3539 965.1395 966.6929 968.0934 1002.2805 1022.4053 1028.4427 1034.5098 1044.6319 1066.1367 1068.4155 1108.2984 1118.8450 1166.0783 1204.3110 1225.9813 1229.7008 1231.1118 1236.8031 1239.2221 1265.8755 1279.2881 1302.1404 1304.0587 1308.5888 1320.1017 1326.5093 1359.6659 1370.8190 1400.2272 1405.8719 1416.6172 1429.8716 1431.3968 1433.8888 1440.3607 1464.9834 1466.0086 1468.6960 1472.6532 1474.7990 1477.2823 1487.6391 1492.8391 1495.1626 1496.4049 1498.7583 1502.9858 1513.2079 1514.8057 1515.8487 1519.6501 1523.6281 1524.8857 1545.5071 1624.9144 1678.4477 3030.2317 3032.5808 3038.2952 3047.2167 3063.2706 3069.4103 3070.9554 3071.5554 3087.9099 3097.6604 3100.3879 3103.6415 3106.7222 3134.1592 3136.6350 3139.9116 3142.1859 3145.7300 3146.4505 3148.1580 3149.7510 3151.1289 3158.7561 3171.8688 3177.3072 3180.3808 3207.7282 3221.3323 3256.2294 3258.0658
redmass: 11.0715 3.0424 3.8600 3.2875 2.4268 3.2301 3.8061 4.0500 1.0838 2.7210 1.7081 1.9247 2.5829 1.7202 1.4858 2.4902 3.0012 1.1245 1.4705 1.6239 2.3873 1.7220 2.0513 1.4325 2.3644 2.8907 3.0425 2.9874 2.6502 2.6226 3.3118 2.2305 2.2053 2.6954 4.3716 3.4426 2.5203 3.6897 7.9738 5.6255 3.1227 2.9108 5.2163 4.0382 5.5996 5.1189 1.4928 5.2628 4.1441 3.0263 3.3900 1.2778 1.3421 1.6601 1.5673 2.2331 1.6547 3.4863 1.7777 1.7778 1.9511 1.4260 1.2160 1.5282 1.4814 1.5144 1.6095 1.6189 1.3687 1.3992 1.3970 1.3880 1.5056 2.1846 1.3262 1.3138 1.6464 1.7166 1.8245 2.6632 2.7336 2.3437 2.0159 1.6274 1.8108 1.8240 1.2625 1.2441 2.1976 2.1518 1.7903 3.6667 1.2615 1.2550 1.3509 1.7238 1.2795 1.6327 1.3911 1.0529 1.4899 1.2338 1.0559 1.0601 1.0560 1.9015 1.0578 1.0477 1.0486 1.0498 1.0783 1.2824 1.1335 1.2036 1.0593 1.3353 1.2843 1.9696 8.3491 8.8790 1.0433 1.0445 1.0438 1.0605 1.0360 1.0385 1.0393 1.0396 1.0600 1.1023 1.0944 1.0925 1.0918 1.1013 1.1000 1.1031 1.1035 1.1031 1.1047 1.0983 1.0954 1.0948 1.0606 1.0993 1.1025 1.1027 1.0898 1.0918 1.0955 1.1106
irintensity: 139.0039 0.4195 0.3175 3.0107 1.7338 1.0873 1.0594 33.1831 0.0243 10.7451 5.8402 9.1097 5.4046 2.1934 0.7368 3.1100 31.8082 0.2017 3.0514 1.4603 4.0124 2.8499 3.2468 2.4928 7.6835 4.8688 22.2959 22.0955 17.2953 24.8831 48.5029 2.8433 1.2172 35.9066 19.9983 23.5909 6.9862 2.4727 11.1934 39.9319 25.7720 49.8753 21.2678 22.2879 88.4479 67.2056 1.8026 7.4102 29.6054 87.5474 25.6849 1.8547 48.1274 290.5524 82.4273 68.9246 63.3240 86.2373 7.3464 10.5542 9.5206 45.0628 0.1549 4.9940 4.2365 3.7334 13.8487 3.7496 3.5402 5.5396 6.4220 26.5208 6.1384 37.5267 7.7603 0.4413 17.0756 25.0404 3.8307 1.7513 0.1064 2.7176 31.5767 4.2934 5.1144 11.0633 57.9633 32.7101 5.2838 81.7142 4.2005 267.1289 1.5743 2.3505 6.4394 6.4914 2.9223 5.8484 4.2753 0.1545 38.7706 1.8812 0.1412 0.4795 0.7712 18.4851 4.0807 2.5550 1.3422 0.6222 3.3286 75.9044 38.6374 81.6865 8.8480 117.8410 188.1928 78.5641 150.8707 943.7332 44.6778 54.9441 108.5005 20.7583 29.7258 27.4634 7.8081 1.9261 13.6382 13.7216 39.6243 23.7720 78.8516 37.2292 47.5212 6.5318 21.5885 38.6687 16.1751 23.1693 33.1776 30.5849 2.4541 15.2569 24.4216 23.6719 5.1200 9.2858 1.1234 2.2636
temp: 298.150 k
press: 1.00000 atm
elementType: 6 6 6 6 8 6 6 8 14 6 6 6 6 6 1 1 1 1 1 1 1 1 1 8 6 1 1 1 6 1 1 1 6 1 1 1 6 1 1 1 6 1 1 1 6 6 1 1 1 1 1 1
symmnumber: 1
zpe: 1185146.0 jmol-1
zpe.correction: 0.451398 hartree
zpe.thermalcorrener: 0.475718 hartree
zpe.thermalcorrenthalpy: 0.476662 hartree
zpe.thermalcorrgfe: 0.400672 hartree
zpe.sumelectzpe: -1218.281608 hartree
zpe.sumelectthermal: -1218.257288 hartree
zpe.sumelectthermalent: -1218.256344 hartree
zpe.sumelectthermalfe: -1218.332334 hartree
dipole: -7.3382 0.0337 0.5603
dipole: 7.3597
quadrupole: -138.7796 -140.8515 -143.8265
quadrupole: 4.1993 -2.0881 -1.4097
quadrupole: 2.3729 0.3011 -2.6739 4.1993 -2.0881 -1.4097
hfenergy: -1218.7330062 hartree
pointgroup: C01 [X(C18H30O3Si1)]
dipole: -2.8870847 0.0132554 0.2204203 debye
polarizability: 315.1573587|4.4338623|281.8642541|-8.76816|0.565005|209.2264253 unknown
InChI: InChI=1S/C18H30O3Si/c1-9-11-18(5,6)13-15-16(14(19)10-12-20-15)21-22(7,8)17(2,3)4/h9-10,12H,1,11,13H2,2-8H3
charge 0 multiplicity 1
52 atoms
C  -1.643122 -0.282072 -0.815289
C  -2.563679 -0.28449 1.252882
C  -3.113964 -1.575234 1.243768
C  -2.495656 -2.365747 -0.420142
O  -2.541006 -1.232609 -1.186082
C  -1.22223 -2.943461 -0.156272
C  -0.113506 -2.110696 -0.146431
O  1.104066 -2.360624 0.137772
Si 2.283137 -0.599722 0.079781
C  -1.993054 1.108395 -1.236446
C  -3.362262 0.914901 0.810904
C  -2.553137 1.914209 -0.032032
C  -0.381527 -0.711525 -0.40936
C  3.044926 1.187078 -0.005514
H  -1.694444 -0.09606 1.878653
H  -4.179808 -1.644998 1.032194
H  -2.756351 -2.295912 1.971237
H  -3.314752 -3.031185 -0.676473
H  -1.118083 1.612387 -1.658738
H  -2.756812 1.028873 -2.016987
H  -1.160151 -3.973663 0.17367
H  -4.229719 0.568018 0.234475
H  -3.753566 1.427548 1.701303
O  0.631562 0.089181 -0.205846
C  -1.399492 2.494732 0.789914
H  -0.840013 3.227864 0.198964
H  -1.779007 2.999922 1.684827
H  -0.692956 1.721648 1.100971
C  -3.447536 3.048314 -0.529554
H  -3.818206 3.649001 0.307489
H  -2.891831 3.714434 -1.197839
H  -4.311387 2.659943 -1.079558
C  2.513187 2.064432 1.134591
H  2.954744 3.071159 1.09273
H  1.426518 2.18167 1.07649
H  2.753755 1.647657 2.119839
C  2.708913 1.866846 -1.339365
H  3.189084 2.854078 -1.40809
H  3.055403 1.278063 -2.197592
H  1.629733 2.014723 -1.450616
C  4.573684 1.115431 0.122789
H  5.006055 2.126239 0.103749
H  4.893437 0.648914 1.061414
H  5.035565 0.555062 -0.697253
C  2.711696 -1.131163 1.840796
C  3.058526 -1.451351 -1.416438
H  2.319585 -1.493119 -2.225711
H  3.945786 -0.945397 -1.804838
H  3.316064 -2.485736 -1.175425
H  1.840023 -0.961898 2.484574
H  2.927789 -2.201286 1.87866
H  3.552064 -0.58102 2.271386
