program: Gaussian 16
title: Title Card Required
version: ES64L-G16RevC.01
frameworkgroup: C1[X(C22H34O7Si)]
method: RM062X
basis: 6-31G(d,p)
operation: Freq
keyword: #P
keyword: Geom=AllCheck
keyword: Guess=TCheck
keyword: SCRF=Check
keyword: GenChk
keyword: RM062X/6-31G(d,p)Freq
converged: YES YES YES YES
title: Mulliken charges:
elementType: C C C C O C C O Si C C C C C C C H H H H H H H H O H H H H H H C H H H C H H H C H H H C O O C O O C C H H H H H C C H H H H H H
charge: 0.185952 -0.108708 -0.311878 0.077450 -0.423862 -0.140425 0.330397 -0.654236 0.943806 -0.231811 -0.214129 -0.193626 0.415917 -0.193156 -0.621688 -0.609758 0.149953 0.136042 0.175166 0.178939 0.164582 0.166673 0.133085 0.166837 -0.603281 0.136851 0.168557 0.137523 0.135076 0.171825 0.137737 -0.353352 0.111385 0.117957 0.118335 -0.349079 0.104831 0.127747 0.116918 -0.344532 0.106917 0.114378 0.118199 0.686336 -0.500173 -0.504141 0.713038 -0.506097 -0.506458 0.024309 -0.394302 0.152214 0.134148 0.135059 0.146648 0.137054 0.013371 -0.394338 0.144424 0.147913 0.140112 0.145009 0.146701 0.143650
chargesum: -0.00000
title: Mulliken charges with hydrogens summed into heavy atoms:
elementType: C C C C O C C O Si C C C C C C C O C C C C O O C O O C C C C
charge: 0.185952 0.041245 -0.032186 0.252616 -0.423862 0.026247 0.330397 -0.654236 0.943806 0.111711 0.085794 -0.193626 0.415917 -0.193156 -0.177049 -0.166827 -0.603281 -0.005675 0.000418 -0.005037 0.686336 -0.500173 -0.504141 0.713038 -0.506097 -0.506458 0.310672 0.024459 0.305708 0.037485
chargesum: 0.00000
polarizability: 3.61307896e+02 1.25095528e+00 3.31558537e+02 2.75038301e+00 1.22265356e+01 2.58228185e+02
1716.lowfreq: -426.4589 -5.4093 -0.3934 -0.0014 -0.0006 0.0008 4.5929 21.0199 28.7529
frequency: -426.4589 20.9830 28.7476 28.7507 33.2221 43.0242 57.9553 65.2819 71.9319 81.2602 87.0408 92.9613 102.4384 108.9966 122.6993 132.4170 150.2638 159.1279 166.4288 178.2768 184.5026 194.2808 200.5600 205.0477 225.7523 229.0334 234.9394 237.8270 249.2854 263.3486 278.6143 279.2630 288.6941 295.9288 296.9881 310.9419 319.4485 321.7514 336.4276 347.9790 368.4420 383.7834 388.9056 393.2321 396.2154 403.5200 408.9119 427.7771 459.8688 471.3558 494.6184 530.8626 549.0939 573.9544 582.2441 603.7102 635.9834 652.3299 700.0072 710.5469 724.0637 753.3029 765.9398 771.9650 783.7273 801.8089 811.5494 819.2361 820.4436 835.5565 846.2152 848.5960 853.7190 867.4069 879.7679 892.2449 903.5878 907.8070 913.6367 920.2669 932.7372 942.9404 961.0958 968.0857 969.1416 993.0807 1022.0544 1031.6363 1035.6504 1050.2406 1056.4842 1067.9541 1085.8354 1094.3324 1129.0639 1140.0534 1153.5117 1155.0735 1187.3141 1188.1961 1196.5731 1226.4736 1234.4983 1236.8200 1251.1801 1260.7109 1282.2561 1290.7799 1297.7452 1302.6700 1308.9368 1311.5958 1313.3304 1318.9490 1339.8005 1354.2490 1361.0305 1385.9205 1404.1004 1407.1363 1407.4260 1410.2013 1422.8087 1434.3487 1441.2624 1446.2218 1449.6153 1454.7030 1457.4845 1463.9534 1472.0410 1478.0963 1482.7488 1487.3355 1494.1169 1495.5788 1496.9713 1498.4903 1498.6059 1506.6943 1507.9343 1513.4095 1515.9749 1523.3691 1523.5577 1532.0151 1544.6016 1579.5927 1652.1059 1692.9459 1863.0555 1881.0564 3039.9577 3041.2012 3044.7004 3060.8692 3071.7395 3076.0642 3085.9411 3089.1220 3092.5709 3097.5764 3108.9482 3110.1159 3113.4744 3118.3725 3129.2550 3131.4098 3133.3513 3137.8888 3144.0090 3144.7783 3146.1302 3149.5497 3167.9020 3171.3015 3171.3453 3174.0396 3174.9743 3178.1678 3181.2677 3192.9509 3221.4742 3242.5425 3259.9511 3270.1048
redmass: 11.0226 3.7709 3.9420 3.9383 3.2382 3.3495 3.4105 3.1607 4.5772 2.7301 3.1453 3.4536 1.7258 2.2066 2.9707 2.7357 3.8924 3.9245 3.0074 1.8966 2.5115 2.5517 2.5313 3.5033 2.9997 1.6020 2.6375 1.4455 2.7930 2.3588 1.3839 2.8286 1.2409 1.4650 1.3879 2.8574 4.2823 3.5655 4.0902 3.2272 3.9259 3.6044 2.9909 3.8251 2.5656 3.1692 2.9616 4.1528 4.5643 4.5498 3.9856 4.2712 5.1840 5.4225 3.1433 5.6728 4.7764 4.1777 3.7916 1.6334 4.7422 6.2461 1.2480 1.2748 5.2325 2.9357 2.6782 1.1231 1.1434 5.4530 1.5196 2.0253 2.1995 1.6756 5.0399 3.8748 1.7603 2.3329 1.9385 1.4438 1.8667 1.9283 1.2146 1.5893 1.5871 1.3084 2.8740 1.4353 1.4115 1.4212 2.3439 2.3506 1.9920 2.6871 3.3276 1.8731 2.2485 2.2668 1.5913 1.5678 2.9295 2.3034 2.7240 2.7216 2.4244 1.4783 1.6089 1.6356 1.2826 1.2631 1.0955 1.3757 1.2425 2.4778 2.4057 1.9779 2.8631 5.6328 1.2546 1.2702 1.3354 1.4534 4.8017 1.2270 1.2936 1.5681 1.5502 1.8342 1.0495 1.0524 1.1640 1.0557 1.0954 1.5455 1.0467 1.0480 1.0461 1.0385 1.0380 1.0616 1.0552 1.0527 1.0497 1.0653 1.0805 1.0919 4.0546 2.5447 6.9729 11.2214 12.4533 12.4456 1.0373 1.0381 1.0398 1.0373 1.0381 1.0612 1.0366 1.0363 1.0588 1.0582 1.1004 1.0991 1.0970 1.0595 1.1020 1.1020 1.1032 1.0993 1.1014 1.1086 1.1070 1.0998 1.1010 1.1020 1.0603 1.1030 1.1053 1.1053 1.1064 1.0995 1.0894 1.0915 1.0961 1.1142
irintensity: 51.6733 0.8190 0.1674 0.3362 0.3194 0.5361 0.1185 0.3343 0.6679 0.7071 1.4759 1.2087 3.3390 3.3564 4.0168 0.5809 4.1935 0.5277 2.1460 0.7524 5.2253 4.9740 5.4650 0.6902 7.3289 2.9862 3.4636 1.5704 4.2177 2.2647 2.6711 0.6132 2.2969 10.4392 2.5119 3.1425 16.8995 4.7801 18.9611 4.5032 0.3481 12.6041 5.7422 11.5762 0.9627 6.5846 10.0483 1.4847 1.5180 2.4736 3.8311 32.8219 8.0151 7.2755 11.6966 46.2922 8.2746 5.9152 37.0439 3.6207 20.9874 5.3004 0.3606 17.9697 4.9042 5.2739 92.4142 1.5760 1.2096 23.9291 34.4393 100.6097 174.7924 177.2113 16.4799 74.6821 6.3257 29.7062 19.7585 89.3537 16.4761 2.2159 0.1558 2.5511 4.0303 7.0662 142.5621 3.1149 7.4145 10.5237 29.8090 20.3795 8.5762 70.4737 93.8239 30.8782 28.1250 20.9897 4.8278 4.7246 25.4221 83.0158 0.1728 1.9753 0.9900 10.1209 127.4509 87.2469 89.5047 46.7785 5.9631 24.2426 39.3130 372.8295 107.6845 129.1594 259.3173 456.2974 3.1586 7.1447 30.6129 81.5332 11.5231 6.1936 4.2047 15.3488 6.3141 40.9001 0.7281 16.1492 9.9017 10.1133 21.5415 39.4516 0.0589 1.1849 0.5171 6.4195 6.6570 3.1692 1.3871 5.4904 7.9564 22.1005 8.0362 5.5242 54.5394 21.1465 236.1687 722.8880 507.3596 54.3449 38.6909 33.6470 71.7695 8.4974 9.1487 17.4505 14.3661 12.4842 24.1196 20.5349 14.4930 58.0368 60.5596 2.7546 29.7027 40.6809 5.6484 12.7454 31.8112 10.3796 6.2915 8.5566 1.9153 21.1755 3.0985 20.1829 33.2305 28.4289 0.5774 1.6034 0.5888 2.2529 0.3472 5.1241
temp: 298.150 k
press: 1.00000 atm
elementType: 6 6 6 6 8 6 6 8 14 6 6 6 6 6 6 6 1 1 1 1 1 1 1 1 8 1 1 1 1 1 1 6 1 1 1 6 1 1 1 6 1 1 1 6 8 8 6 8 8 6 6 1 1 1 1 1 6 6 1 1 1 1 1 1
symmnumber: 1
zpe: 1414220.7 jmol-1
zpe.correction: 0.538648 hartree
zpe.thermalcorrener: 0.572257 hartree
zpe.thermalcorrenthalpy: 0.573201 hartree
zpe.thermalcorrgfe: 0.473528 hartree
zpe.sumelectzpe: -1673.805686 hartree
zpe.sumelectthermal: -1673.772077 hartree
zpe.sumelectthermalent: -1673.771133 hartree
zpe.sumelectthermalfe: -1673.870806 hartree
dipole: 0.9813 1.8057 1.3435
dipole: 2.4553
quadrupole: -176.2140 -164.2894 -193.2814
quadrupole: -7.8580 6.4245 3.4998
quadrupole: 1.7143 13.6389 -15.3532 -7.8580 6.4245 3.4998
hfenergy: -1674.344334 hartree
pointgroup: C01 [X(C22H34O7Si1)]
dipole: 0.3860926 0.7104082 0.5285676 debye
polarizability: 361.3078963|1.2509549|331.558537|2.7503832|12.2265356|258.2281846 unknown
InChI: InChI=1S/C22H34O7Si/c1-9-13-22(19(24)26-10-2,20(25)27-11-3)15-17-18(23)16(12-14-28-17)29-30(7,8)21(4,5)6/h9,12,14H,1,10-11,13,15H2,2-8H3
charge 0 multiplicity 1
64 atoms
C  0.557292 1.57899 -1.090547
C  0.790201 1.832788 1.162328
C  0.267526 3.098321 1.338049
C  -0.61084 3.487594 -0.674333
O  0.429131 2.900776 -1.277361
C  -1.831569 2.783088 -0.577476
C  -1.852463 1.425446 -0.757872
O  -2.991101 0.728477 -0.699022
Si -3.25132 -0.784111 0.072098
C  1.896872 1.012451 -1.412868
C  2.267976 1.561472 0.993264
C  2.54279 0.512929 -0.101929
C  -0.595648 0.724011 -0.9825
C  -5.057703 -0.589777 0.618505
C  -2.137789 -0.898757 1.572334
C  -3.101617 -2.225002 -1.108897
H  0.210791 0.977608 1.499122
H  0.924636 3.964397 1.295715
H  -0.58402 4.567597 -0.755358
H  1.812051 0.18789 -2.124643
H  2.533703 1.792136 -1.835656
H  -2.73419 3.317607 -0.302425
H  2.78875 2.488502 0.724276
H  2.68224 1.202488 1.941287
O  -0.509025 -0.518342 -1.011204
H  -3.191743 -3.168604 -0.55889
H  -2.127868 -2.203207 -1.600902
H  -3.884116 -2.20827 -1.874085
H  -2.096052 0.066513 2.09097
H  -1.118617 -1.184583 1.298004
H  -2.52294 -1.632687 2.289403
C  -5.582768 -1.934637 1.139553
H  -6.610793 -1.825574 1.510447
H  -5.598352 -2.696602 0.352257
H  -4.977952 -2.320779 1.969053
C  -5.921601 -0.135202 -0.56517
H  -6.970966 -0.037068 -0.255222
H  -5.592746 0.834684 -0.951131
H  -5.89219 -0.853129 -1.392801
C  -5.147774 0.458199 1.735393
H  -6.194862 0.624967 2.022259
H  -4.607534 0.141667 2.634596
H  -4.735228 1.422471 1.415906
C  4.047754 0.344399 -0.296809
O  4.682523 0.794114 -1.218825
O  4.585556 -0.334986 0.720336
C  1.96994 -0.848247 0.309055
O  1.453852 -1.087666 1.37377
O  2.144152 -1.743257 -0.661535
C  1.446979 -2.98858 -0.486247
C  1.501801 -3.720177 -1.806354
H  0.419554 -2.758328 -0.191742
H  1.926803 -3.550585 0.321086
H  0.98695 -4.680326 -1.719104
H  1.008758 -3.13046 -2.583158
H  2.535172 -3.906825 -2.109478
C  6.010139 -0.537676 0.658616
C  6.401542 -1.336102 1.879485
H  6.501084 0.439381 0.628905
H  6.246976 -1.062391 -0.271342
H  7.47936 -1.515964 1.87223
H  6.145644 -0.795463 2.793776
H  5.888182 -2.300449 1.890375
H  -0.658956 3.234854 1.884154
