program: Gaussian 09
title: 000005468
version: EM64L-G09RevD.01
frameworkgroup: C1[X(C14H12O3S)]
method: RPBEPBE
basis: SDD
operation: Freq
keyword: #p
keyword: freq=noraman
keyword: PBEPBE/SDD
title: #p freq=noraman PBEPBE/SDD
converged: YES YES NO NO
title: Mulliken charges:
elementType: S O O O C C C C C C C C C C C C C C H H H H H H H H H H H H
charge: 0.297361 -0.403410 -0.228226 -0.236265 -0.231477 -0.111286 -0.250016 -0.270401 -0.672539 -0.277693 0.157791 0.191072 0.311523 -0.378107 -0.355768 -0.237687 -0.231708 -0.229112 0.259429 0.288023 0.237410 0.243825 0.228355 0.283455 0.266055 0.270298 0.232103 0.233343 0.233304 0.380347
chargesum: 0.00000
title: Mulliken charges with hydrogens summed into heavy atoms:
elementType: S O O O C C C C C C C C C C C C C C
charge: 0.297361 -0.023063 -0.228226 -0.236265 0.027953 -0.111286 -0.250016 0.017623 0.037051 0.005762 0.157791 0.191072 0.311523 -0.112052 -0.085469 -0.005585 0.001635 0.004192
polarizability: 2.80810283e+02 3.98102576e+00 1.68885375e+02 6.02911091e+00 6.84967670e+00 1.04316539e+02
1716.lowfreq: -9.1862 -4.1703 0.0006 0.0011 0.0017 3.2824 20.8646 29.3285 39.3616
frequency: 20.1743 29.2735 39.3398 46.0993 80.3819 92.4192 129.1193 145.3532 165.1255 212.0393 227.8789 229.6296 261.3157 301.5265 322.5604 359.8269 405.5301 406.7902 444.3081 499.1556 527.1845 568.8499 597.7366 613.2812 617.4068 629.9966 665.2846 686.2546 697.1794 701.5625 711.9333 767.8941 794.3129 802.3651 836.4881 845.5221 862.0612 926.0563 942.9559 981.1639 985.9010 989.1977 1003.3793 1018.2581 1027.4675 1035.7468 1069.6723 1082.9068 1086.8472 1119.3055 1142.0681 1174.4854 1188.9221 1223.6785 1239.5073 1281.7487 1300.0805 1317.5180 1330.6803 1367.0317 1382.1238 1386.8144 1432.3000 1469.4454 1473.5134 1475.4102 1486.6893 1515.9006 1545.0661 1586.0925 1607.1622 1660.9391 2996.1137 3053.0998 3097.4003 3114.0088 3128.5696 3138.6397 3150.3500 3159.7114 3169.8384 3175.4671 3193.8739 3501.1943
redmass: 4.8768 6.4842 6.0722 5.5346 6.6379 5.4909 7.0966 5.7244 5.0846 4.6739 4.3179 1.0684 4.8907 8.0140 5.7727 7.2488 2.9367 4.7213 4.8166 5.0524 5.4879 3.7884 3.5441 6.1604 2.9525 2.5743 5.2132 2.9255 3.3756 5.4426 1.8104 4.3865 2.4627 2.9326 1.5722 3.4135 1.2534 1.4208 1.4115 2.5976 1.4692 4.7906 1.3337 2.0861 2.0053 2.4570 1.6214 1.5977 1.8505 3.3138 2.3053 1.0558 1.1256 1.4724 1.5147 2.9505 2.2359 1.3623 2.2839 1.7835 8.6483 1.2024 2.2785 1.1224 1.0631 2.2372 5.2078 9.3278 5.8706 6.2013 6.0304 8.2825 1.0346 1.0854 1.1005 1.1013 1.0851 1.0882 1.0926 1.0962 1.1011 1.0912 1.0996 1.0639
irintensity: 1.2803 2.3707 1.5485 1.9599 0.5805 1.3068 0.8353 1.9672 0.4787 0.5035 1.6735 0.5799 3.1587 3.8939 1.5272 1.5346 0.4664 15.9826 3.3411 9.7538 8.9255 20.0302 27.1241 1.9287 72.7184 26.9427 38.1218 30.3178 5.9101 16.9601 119.4125 14.4679 14.6450 8.5485 46.8204 39.1969 8.5679 0.4415 3.0689 3.6439 5.5694 0.3434 0.6935 23.6281 24.9482 312.6802 7.4134 11.9548 45.9818 14.2072 27.7361 0.1255 13.9869 17.3450 8.0499 176.8106 100.8742 8.2831 42.5441 29.6391 1.9307 23.6148 6.7518 9.5044 11.8652 6.2834 230.4914 119.5003 44.9446 6.1513 16.8526 185.2698 27.6074 2.0286 31.9572 11.9775 0.2362 6.3711 20.0496 18.3650 21.3109 3.4310 0.6002 27.2340
temp: 298.150 k
press: 1.00000 atm
elementType: 16 8 8 8 6 6 6 6 6 6 6 6 6 6 6 6 6 6 1 1 1 1 1 1 1 1 1 1 1 1
symmnumber: 1
zpe: 586633.5 jmol-1
zpe.correction: 0.223437 hartree
zpe.thermalcorrener: 0.240194 hartree
zpe.thermalcorrenthalpy: 0.241139 hartree
zpe.thermalcorrgfe: 0.176175 hartree
zpe.sumelectzpe: -1163.141604 hartree
zpe.sumelectthermal: -1163.124846 hartree
zpe.sumelectthermalent: -1163.123902 hartree
zpe.sumelectthermalfe: -1163.188865 hartree
dipole: -0.9219 2.8678 0.6866
dipole: 3.0896
quadrupole: -88.5665 -115.0967 -113.0789
quadrupole: 10.8044 7.6953 -8.1150
quadrupole: 17.0142 -9.5160 -7.4982 10.8044 7.6953 -8.1150
hfenergy: -1163.3650406 hartree
pointgroup: C01 [X(C14H12O3S1)]
dipole: 0.4042816 0.7283496 -0.8852006 debye
polarizability: 280.3885455|-3.5582442|139.1958262|9.0075881|-33.2054874|134.4278261 unknown
InChI: InChI=1S/C14H12O3S/c1-9(14(16)17)11-7-8-12(18-11)13(15)10-5-3-2-4-6-10/h2-9,16H,1H3
charge 0 multiplicity 1
30 atoms
S  1.247258 -0.896777 1.552748
O  5.18481 1.365326 1.159642
O  -1.684249 -1.442187 2.014601
O  4.746286 1.151006 -1.110537
C  3.885071 -0.556267 0.473297
C  2.39282 -0.358027 0.274923
C  -0.154782 -0.377073 0.524524
C  1.721994 0.151717 -0.835418
C  4.409884 -1.762867 -0.358971
C  0.296327 0.140684 -0.694423
C  -1.511893 -0.64522 1.032941
C  4.625978 0.715468 0.055018
C  -2.695349 0.013239 0.376444
C  -2.645492 1.32227 -0.173941
C  -3.929494 -0.690851 0.383844
C  -3.80862 1.907181 -0.721276
C  -5.084844 -0.11151 -0.17725
C  -5.026866 1.189354 -0.734249
H  4.09638 -0.725435 1.542627
H  2.248802 0.524617 -1.71693
H  3.852268 -2.674558 -0.086343
H  4.27387 -1.571229 -1.436198
H  5.483664 -1.933203 -0.163618
H  -0.386883 0.469753 -1.479895
H  -1.715837 1.899056 -0.132332
H  -3.958857 -1.685204 0.841392
H  -3.766906 2.923636 -1.127854
H  -6.029445 -0.666201 -0.177562
H  -5.926739 1.643428 -1.164071
H  5.647343 2.195271 0.858465
