program: Gaussian 16
title: Title Card Required
version: ES64L-G16RevC.01
frameworkgroup: C1[X(C24H36O8Si)]
method: RM062X
basis: 6-31G(d,p)
operation: Freq
keyword: #P
keyword: Geom=AllCheck
keyword: Guess=TCheck
keyword: SCRF=Check
keyword: GenChk
keyword: RM062X/6-31G(d,p)Freq
converged: YES YES NO YES
title: Mulliken charges:
elementType: C C C C O C C O Si C C C C C C C H H H H H H H H O H H H H H H C H H H C H H H C H H H C O O C O O C C H H H H H C C H H H H H C O C H H H
charge: 0.212027 -0.057169 -0.185699 0.118429 -0.425111 -0.183950 0.375514 -0.630987 0.947898 -0.238309 -0.249635 -0.198845 0.375661 -0.194866 -0.623513 -0.608337 0.163835 0.120224 0.187751 0.182275 0.161180 0.176198 0.137356 0.178988 -0.652781 0.135670 0.166770 0.134856 0.167753 0.168078 0.125796 -0.353447 0.109256 0.114523 0.118935 -0.346154 0.102688 0.122383 0.113109 -0.343602 0.098863 0.115268 0.130767 0.690805 -0.498301 -0.505318 0.732390 -0.506965 -0.511139 0.025656 -0.393926 0.155250 0.132063 0.134425 0.145885 0.134841 0.012688 -0.394393 0.144215 0.149007 0.140542 0.145132 0.148332 0.412175 -0.478913 -0.441308 0.161691 0.139034 0.156486
chargesum: -0.00000
title: Mulliken charges with hydrogens summed into heavy atoms:
elementType: C C C C O C C O Si C C C C C C C O C C C C O O C O O C C C C C O C
charge: 0.212027 0.106666 -0.065475 0.306180 -0.425111 -0.007752 0.375514 -0.630987 0.947898 0.105145 0.066709 -0.198845 0.375661 -0.194866 -0.161885 -0.171042 -0.652781 -0.010733 -0.007974 0.001296 0.690805 -0.498301 -0.505318 0.732390 -0.506965 -0.511139 0.312970 0.021225 0.305910 0.039613 0.412175 -0.478913 0.015902
polarizability: 3.99428446e+02 8.95701515e+00 3.62455184e+02 -1.15049015e+01 1.45143602e+01 2.68670861e+02
1716.lowfreq: -4.3446 -0.0016 -0.0010 0.0007 5.5375 6.9206 23.8911 33.7767 37.1451
frequency: 23.8628 33.7091 37.1332 41.1244 45.4596 55.0460 57.5262 61.5545 66.4091 76.0019 80.8551 83.3660 98.9799 101.0884 104.0182 109.7608 116.4744 120.8236 129.6454 136.5633 159.7664 167.3500 170.7950 185.5640 186.7544 194.0557 198.4305 206.6010 211.1406 222.6095 227.8060 234.4066 240.1077 248.6643 255.8868 262.6899 274.2203 281.7159 290.9710 295.1290 299.4563 313.0918 324.9314 328.7518 338.0275 352.3384 377.3015 384.0566 386.2448 397.4435 398.9075 403.8707 440.1401 455.1851 460.1910 498.1036 535.4913 564.2810 574.5220 580.7140 585.0071 594.1247 624.4569 638.5844 641.3226 692.1051 717.3740 718.2483 744.3308 777.4822 783.8777 800.9970 810.9905 816.7581 817.9412 819.9152 834.2296 838.4296 851.9513 853.9509 873.1595 876.0934 882.1523 892.5811 907.7302 914.8480 923.2900 939.0111 954.3817 962.6809 968.5499 969.4828 972.3607 1025.8750 1029.8867 1033.7049 1038.5119 1047.0840 1066.2348 1077.9804 1089.9389 1102.2651 1125.1836 1137.6333 1151.5472 1154.2112 1173.1731 1187.0869 1187.5087 1213.2336 1231.2355 1234.0430 1236.2716 1251.2049 1273.4511 1284.5921 1294.5535 1297.3795 1306.7318 1307.7914 1313.8340 1318.5782 1331.7905 1333.6178 1357.5405 1359.0429 1381.8404 1403.4595 1404.8962 1405.6558 1406.8098 1408.7700 1420.3059 1435.6460 1440.6221 1446.9192 1448.7510 1458.2666 1460.8675 1463.7026 1470.1167 1471.9794 1480.6787 1481.8616 1485.2718 1495.2442 1495.7733 1496.1367 1496.5381 1497.5762 1500.8866 1507.1404 1507.5819 1514.8015 1517.1317 1522.3224 1522.9811 1529.9702 1587.4314 1625.6069 1660.3299 1716.7414 1831.4317 1865.9454 1882.6427 3039.5211 3040.2252 3043.8918 3067.1575 3070.6511 3074.7325 3075.5792 3085.4516 3090.1201 3092.9323 3097.5203 3107.4660 3108.5971 3110.8953 3114.5625 3128.2951 3128.6881 3138.5249 3144.5440 3145.1000 3145.5183 3148.4967 3148.7924 3150.4010 3171.1288 3171.2880 3175.2911 3175.3113 3178.9249 3186.3131 3192.3730 3194.2934 3199.6485 3208.8266 3260.1465 3282.9708
redmass: 3.4652 4.0784 3.5068 3.1487 3.6440 3.9709 3.4285 5.5391 3.7199 4.3307 3.2724 3.1594 2.5937 3.0004 2.9574 2.6494 1.6462 1.3806 3.3562 3.1903 5.6290 3.6784 3.1515 2.1711 2.4893 3.3699 2.8888 2.4585 3.0583 3.2547 2.0596 1.6098 1.8309 2.6411 2.5090 2.2443 1.4451 2.1157 1.3596 1.2801 2.0224 2.6379 3.5887 3.7597 2.4174 5.3625 3.7143 4.0946 2.8251 3.0474 2.4239 3.3961 3.3981 5.4664 6.1612 4.3672 4.5151 3.9393 5.0175 4.7788 3.0336 3.6865 4.1037 5.0015 5.2753 4.1122 3.6588 1.7731 8.0735 1.2581 4.7739 3.2780 1.7743 1.2230 2.1859 1.2838 3.0072 1.4853 2.1002 2.0408 2.2437 3.1434 3.0040 3.2153 2.2575 2.1493 2.3297 1.2718 2.7426 1.2069 1.6004 1.5932 1.7702 1.3324 2.0058 2.0523 1.4078 1.8068 2.4503 3.0543 3.3149 1.6883 3.2578 2.5578 2.2649 2.2853 2.0350 1.5810 1.5683 2.0079 2.2820 2.7138 2.7344 2.4109 1.6627 1.7243 1.2804 1.5153 1.2542 1.0938 1.1429 2.7530 1.6066 2.8211 1.5423 2.8169 1.4780 1.6587 1.3464 1.3055 1.3884 1.3029 2.7028 1.2309 2.6866 1.6106 1.5858 1.0715 1.2596 1.1888 1.1553 1.0563 1.0524 1.0472 1.0873 1.1901 1.0461 1.0477 1.0593 1.0378 2.2324 1.0670 1.0626 1.0676 1.0499 1.0878 1.0578 1.0910 6.3521 5.4015 9.9970 6.6995 9.9190 12.4585 12.4009 1.0394 1.0386 1.0404 1.0378 1.0379 1.0379 1.0592 1.0364 1.0364 1.0602 1.0580 1.0614 1.0997 1.0973 1.0958 1.1021 1.1041 1.1022 1.1007 1.1087 1.0999 1.0993 1.0992 1.1053 1.1028 1.1030 1.1030 1.1054 1.1053 1.1001 1.0996 1.0929 1.1038 1.0883 1.0912 1.0990
irintensity: 0.7322 0.1829 0.0953 0.3900 0.7669 0.5659 0.8753 0.5728 1.6780 1.2657 0.0546 2.0414 0.4202 9.5493 2.5720 0.2275 1.1228 0.7767 6.1339 2.7872 6.6884 1.1195 3.2664 1.8079 2.9433 2.3901 12.2638 1.5163 1.6901 4.3673 1.7656 2.0878 2.0931 0.8272 2.9099 3.5822 4.1854 0.1946 6.9665 1.5312 13.1553 8.1673 5.2762 10.5137 7.3706 0.5529 13.1986 13.5460 4.4762 9.0481 4.3166 9.1708 16.5761 8.1330 6.6691 0.8924 16.2905 12.0209 8.6316 9.2522 17.3018 16.2257 21.8760 3.7653 22.4039 29.2186 24.8187 5.0497 4.1931 3.2626 10.0391 4.1760 8.4893 13.6014 95.0010 2.2590 47.4622 56.0881 71.2020 350.9719 23.4291 37.6013 147.5822 34.7438 74.2965 14.0150 11.5636 3.7931 8.4151 0.5284 2.8942 3.8944 36.7028 38.0731 62.0985 36.2919 6.9395 2.9835 25.5122 33.5778 24.2579 4.2487 102.9516 30.7488 16.3040 30.9340 17.6770 6.3478 8.4677 67.0789 195.8058 2.8092 1.1220 1.0217 13.9886 148.7764 59.8624 174.7811 39.4785 6.0351 2.8406 468.1826 14.9939 15.4374 16.4154 374.4961 10.6269 150.7313 27.9859 25.1895 82.2595 2.2209 357.3916 5.1305 3.9481 27.5320 1.6526 5.5066 28.2706 18.9201 7.5993 17.1308 7.1961 9.7411 19.6957 60.5461 0.7836 7.4958 5.1147 7.8093 271.4518 2.8184 2.4865 8.9382 8.3935 18.0918 16.5991 6.8906 160.1311 140.8161 770.7296 175.0840 200.8494 541.4314 35.0770 34.5031 33.9021 88.2281 24.3731 10.8975 1.1998 11.1105 15.4895 11.8159 29.7042 20.8720 3.9838 24.0784 43.4479 62.0324 35.3316 6.9292 24.8598 36.3347 10.5927 7.2158 10.7631 3.7571 1.3997 11.6835 9.4292 21.6251 33.9799 27.4609 2.6767 1.9083 7.2605 9.1455 1.9873 0.0936 2.5246
temp: 298.150 k
press: 1.00000 atm
elementType: 6 6 6 6 8 6 6 8 14 6 6 6 6 6 6 6 1 1 1 1 1 1 1 1 8 1 1 1 1 1 1 6 1 1 1 6 1 1 1 6 1 1 1 6 8 8 6 8 8 6 6 1 1 1 1 1 6 6 1 1 1 1 1 6 8 6 1 1 1
symmnumber: 1
zpe: 1514012.0 jmol-1
zpe.correction: 0.576657 hartree
zpe.thermalcorrener: 0.614940 hartree
zpe.thermalcorrenthalpy: 0.615885 hartree
zpe.thermalcorrgfe: 0.506348 hartree
zpe.sumelectzpe: -1826.385742 hartree
zpe.sumelectthermal: -1826.347458 hartree
zpe.sumelectthermalent: -1826.346514 hartree
zpe.sumelectthermalfe: -1826.456051 hartree
dipole: -2.4859 4.1233 1.2104
dipole: 4.9645
quadrupole: -195.0882 -173.1652 -207.6378
quadrupole: 7.1818 14.2066 5.3167
quadrupole: -3.1245 18.7985 -15.6740 7.1818 14.2066 5.3167
hfenergy: -1826.9623988 hartree
pointgroup: C01 [X(C24H36O8Si1)]
dipole: -0.9804322 1.6195047 0.4805205 debye
polarizability: 399.4006286|9.043326|362.4053236|-11.5075863|14.7431331|268.7485381 unknown
InChI: InChI=1S/C24H36O8Si/c1-9-29-21(27)24(22(28)30-10-2,14-11-12-17(3)25)16-19-20(26)18(13-15-31-19)32-33(7,8)23(4,5)6/h11-13,15H,9-10,14,16H2,1-8H3
charge 0 multiplicity 1
69 atoms
C  -0.59705643 1.0041809 1.69723226
C  -0.83994667 1.82462788 -0.96144229
C  -0.25831045 3.03021314 -0.8989264
C  0.81623958 2.80193593 2.11311374
O  -0.38879083 2.26000611 2.11271622
C  1.9186841 2.0860833 1.72781831
C  1.76169009 0.76416386 1.29797207
O  2.81006147 0.07438279 0.91218
Si 2.9368385 -1.32270453 -0.11195619
C  -2.02427437 0.58640764 1.67128082
C  -2.29554896 1.57041648 -0.70192539
C  -2.58997071 0.3827934 0.24438012
C  0.45279655 0.14742693 1.30340071
C  4.75734273 -1.13315898 -0.61724204
C  1.85350101 -1.14507898 -1.61896264
C  2.71678734 -2.90498059 0.86029912
H  -0.23985231 0.97311705 -1.27949149
H  -0.81920372 3.91622536 -0.60636835
H  0.82128101 3.82072832 2.47715058
H  -2.138328 -0.35597338 2.21554882
H  -2.63050103 1.34489699 2.17059261
H  2.89829035 2.54877165 1.72363955
H  -2.77040435 2.47051462 -0.29465642
H  -2.77387596 1.3413925 -1.66126109
O  0.27345518 -1.04530277 0.93953765
H  2.77075026 -3.76472858 0.18264821
H  1.73945197 -2.90724658 1.34572993
H  3.4928842 -3.03127946 1.62181228
H  1.8125329 -0.08864762 -1.90633147
H  0.83416631 -1.48678304 -1.42790598
H  2.26922368 -1.70632595 -2.46389117
C  5.21449856 -2.4019178 -1.35067056
H  6.2472417 -2.28614597 -1.70648741
H  5.19096288 -3.28052157 -0.69577995
H  4.5926827 -2.61952854 -2.22741546
C  5.64445634 -0.92299128 0.61636319
H  6.6983729 -0.8397026 0.31725709
H  5.37490494 -0.00751813 1.15183118
H  5.5715851 -1.75900455 1.32173402
C  4.90152315 0.07638232 -1.55110128
H  5.95797556 0.23992145 -1.80520724
H  4.35534206 -0.06891039 -2.48958456
H  4.51882789 0.99305373 -1.08927895
C  -4.11537168 0.26362919 0.36737473
O  -4.75894719 0.56297928 1.34249861
O  -4.65004091 -0.18409783 -0.77114613
C  -2.10604689 -0.92981121 -0.387241
O  -1.6125755 -1.02175363 -1.48430122
O  -2.38050147 -1.96031529 0.41007915
C  -1.77387944 -3.20842232 0.03482948
C  -1.90092383 -4.13830799 1.21811261
H  -0.7280862 -3.00922349 -0.21294834
H  -2.28217013 -3.59435742 -0.85446052
H  -1.45472689 -5.10683329 0.97836366
H  -1.37783935 -3.71756951 2.08044784
H  -2.94926334 -4.29567377 1.48463957
C  -6.08320093 -0.3305826 -0.78124028
C  -6.46640384 -0.87618739 -2.13639246
H  -6.53537354 0.64602691 -0.58540156
H  -6.3689986 -1.00439886 0.03136173
H  -7.55008597 -1.0067685 -2.18762947
H  -6.16107366 -0.19078643 -2.93053474
H  -5.99080752 -1.84419881 -2.31041755
C  1.1843163 3.1932307 -1.20758912
O  1.90005834 2.24886701 -1.49508275
C  1.73268447 4.59800477 -1.12534664
H  1.21493286 5.2442549 -1.84185488
H  1.55057338 5.0126482 -0.12793209
H  2.80189431 4.59501529 -1.33636881
