program: Gaussian 16
title: TSb2-1-stepwise-unlock1-g16-iso
version: ES64L-G16RevA.03
method: RM062X
basis: 6-31G(d,p)
operation: Freq
keyword: #N
keyword: Geom=AllCheck
keyword: Guess=TCheck
keyword: SCRF=Check
keyword: GenChk
keyword: RM062X/6-31G(d,p)
keyword: Freq
converged: YES YES YES YES
title: Mulliken charges:
elementType: C C C C O C C O Si C C C C C C C H H H H H H H H O H H H H H H C H H H C H H H C H H H C O O C O O C C H H H H H C C H H H H H C C C C H C H C H H N C H H H C H H H
charge: 0.182780 -0.149024 -0.186422 0.078520 -0.438115 -0.124541 0.328718 -0.647609 0.942203 -0.230575 -0.208465 -0.198703 0.414757 -0.196545 -0.606728 -0.599704 0.156896 0.123922 0.168493 0.178295 0.166302 0.168492 0.136246 0.168463 -0.597842 0.155185 0.144956 0.127960 0.130973 0.161876 0.141647 -0.353640 0.110398 0.118576 0.117001 -0.349425 0.105068 0.129247 0.113751 -0.336101 0.102069 0.106200 0.126476 0.686789 -0.500877 -0.503777 0.708517 -0.505228 -0.505698 0.024824 -0.394933 0.150729 0.135079 0.135054 0.146688 0.137501 0.013691 -0.394299 0.144525 0.147483 0.139854 0.145774 0.146351 0.114549 -0.189433 -0.149785 -0.172441 0.118109 -0.161000 0.104209 0.311527 0.122824 0.111007 -0.546138 -0.212835 0.130078 0.143923 0.138263 -0.212299 0.143529 0.126768 0.139066
chargesum: -0.00000
title: Mulliken charges with hydrogens summed into heavy atoms:
elementType: C C C C O C C O Si C C C C C C C O C C C C O O C O O C C C C C C C C C C N C C
charge: 0.182780 0.007871 -0.062500 0.247014 -0.438115 0.043951 0.328718 -0.647609 0.942203 0.114021 0.096244 -0.198703 0.414757 -0.196545 -0.172232 -0.171603 -0.597842 -0.007665 -0.001360 -0.001356 0.686789 -0.500877 -0.503777 0.708517 -0.505228 -0.505698 0.310632 0.024311 0.305699 0.037680 0.114549 -0.071323 -0.045576 -0.049617 -0.049994 0.311527 -0.546138 0.199430 0.197066
1716.lowfreq: -438.0344 -6.2885 0.0012 0.0013 0.0014 0.4788 3.2132 16.8490 19.2022
frequency: -438.0344 16.7750 19.1970 24.7340 31.6657 36.3802 39.9749 44.7127 53.0259 55.8283 67.6737 72.2122 80.5978 81.7175 91.2198 99.5369 102.6103 108.2031 123.0191 123.3437 136.2464 146.2925 153.3250 157.4939 162.3770 171.4792 173.5963 187.9238 190.8081 200.8025 211.4821 218.4432 226.0666 226.7750 233.0772 236.9242 245.3106 250.4745 261.3195 273.3603 277.0026 288.3613 293.4974 297.9425 301.7299 312.9608 321.6464 327.2349 336.7949 343.2801 366.7933 377.9674 387.1938 387.9413 397.1576 400.4073 407.6263 421.2848 428.1547 438.0979 458.2086 469.9298 476.2808 488.7583 506.1771 528.4726 545.6172 550.3196 567.7564 582.6178 585.2423 622.7425 633.3998 653.9129 656.0450 701.0506 709.9667 727.5421 740.6661 744.3777 761.3264 769.4222 791.5820 800.8183 807.2956 817.9613 818.4115 821.0323 831.3023 832.9643 841.5770 849.9904 852.7012 864.2430 865.4140 880.6150 891.3082 898.0027 910.2928 915.4244 917.2170 934.1240 953.6376 961.4126 964.5222 968.5799 970.1975 972.9128 985.9607 1017.1928 1026.5025 1032.4459 1035.6893 1039.4430 1058.4533 1065.7692 1082.2093 1089.6416 1092.4668 1125.3324 1133.3272 1140.7751 1149.1646 1151.0876 1154.3462 1158.5362 1167.7752 1186.4831 1188.3474 1206.3639 1213.2836 1217.5355 1234.0947 1237.0915 1248.1083 1251.1361 1257.4791 1269.1880 1289.5154 1291.0630 1299.7512 1303.8138 1305.1164 1307.1651 1311.8733 1318.9726 1337.4164 1339.4302 1348.4675 1358.5146 1370.9837 1377.9395 1387.0405 1401.5397 1403.5497 1406.3840 1407.6203 1409.3549 1418.3994 1433.8821 1443.2189 1448.1754 1451.0218 1452.1437 1458.3530 1463.6291 1470.7927 1473.0636 1479.5726 1481.2615 1485.6205 1492.6908 1494.4953 1495.7961 1496.6046 1496.7525 1496.8524 1498.0309 1502.9629 1506.6069 1508.1708 1513.7983 1517.2461 1522.3757 1522.8818 1523.0079 1532.6320 1539.0531 1543.0474 1557.5812 1590.1209 1640.0306 1644.1717 1695.3979 1701.5486 1863.2492 1881.4478 3019.5573 3026.9178 3037.0031 3040.8572 3043.8309 3059.9941 3074.7819 3077.7820 3085.2683 3089.4123 3093.0093 3097.5793 3107.1176 3109.1360 3109.6353 3110.6437 3112.6537 3119.7908 3129.2626 3136.5826 3136.8241 3137.6818 3138.8609 3144.6711 3145.0522 3152.9901 3160.6458 3170.0608 3170.6332 3173.7014 3174.0775 3174.1512 3178.6021 3181.3499 3182.5173 3185.0183 3192.8515 3209.9646 3223.5838 3246.3476 3252.1021 3254.8212 3261.5549
redmass: 10.7811 3.7451 4.4128 3.9544 3.8782 3.7079 3.4447 3.3239 3.3474 3.2843 4.4828 4.0471 3.8743 2.8096 2.9920 3.3279 3.8596 2.3799 3.1635 1.6678 4.8223 2.8043 2.2449 3.8925 2.9406 2.2803 1.4565 2.8205 3.2625 4.9189 2.7811 1.5291 2.3320 2.3798 1.4459 2.0028 1.8539 2.2952 2.0633 2.3859 1.6076 1.2591 2.0218 1.3604 2.1225 2.5474 3.3030 3.8884 4.0060 3.4933 3.1934 3.5560 3.3519 4.0915 2.8022 2.3527 4.0596 3.4818 3.1254 4.2415 5.5535 5.3220 4.1172 3.5600 4.2994 3.5798 4.3510 2.4861 3.8434 4.3801 3.5236 4.4727 5.2402 5.1255 5.3778 3.7720 1.6214 5.9574 3.9114 4.2686 6.2635 1.2648 4.5600 2.7915 2.6129 1.1316 1.3655 1.2710 1.2899 5.2062 1.7576 2.0770 2.2012 2.1010 2.7645 3.8994 2.9550 2.2334 2.0045 1.8650 2.1822 1.7643 1.4375 1.3829 1.2482 1.6111 1.3719 1.5025 3.0554 2.9499 2.3821 1.4300 1.2955 1.3984 2.3925 2.8702 2.6921 2.5758 1.4404 2.5937 2.7596 1.2415 2.0648 1.3821 2.2870 1.6973 1.5164 1.5828 1.5653 1.7168 1.3888 2.0503 2.7149 2.7041 1.6686 2.3931 1.7878 1.8495 2.2877 2.1516 1.2772 1.4710 1.2640 1.0953 1.1134 2.4968 1.9373 2.5943 1.7553 3.0755 2.3256 2.6565 3.7203 1.4877 2.3796 1.3672 1.2652 1.4896 4.8747 1.2272 1.9207 1.5674 1.7411 1.2387 1.0575 1.0574 1.2071 1.0506 1.0584 2.0600 1.4018 1.0460 1.0751 1.1199 1.1325 1.0383 1.0383 1.0467 1.0627 1.0645 1.0561 1.0538 1.0502 1.0736 1.0896 1.0915 1.0924 1.1017 3.7157 2.8549 3.1861 6.8097 6.7842 11.3296 6.2530 12.4484 12.4529 1.0490 1.0524 1.0388 1.0378 1.0392 1.0370 1.0374 1.0614 1.0365 1.0364 1.0584 1.0581 1.0975 1.0903 1.0989 1.0907 1.0974 1.0593 1.1020 1.1011 1.1033 1.1018 1.0995 1.1075 1.1086 1.1001 1.1023 1.0885 1.1028 1.0996 1.1053 1.1030 1.1053 1.0976 1.1068 1.1001 1.0901 1.0893 1.0866 1.0911 1.0914 1.0912 1.0965
irintensity: 42.8418 0.4800 0.7057 0.4505 0.1894 0.4740 0.1837 0.4340 0.2325 0.0350 0.7796 0.9501 0.3595 1.2272 0.7051 1.1248 0.0742 13.7413 11.0186 3.1900 0.5336 3.0066 4.6351 1.4835 4.7748 2.5785 1.6979 0.3473 9.5243 7.3609 1.7294 1.7198 8.4036 4.1809 2.0306 2.1207 0.9139 0.8878 2.8393 1.4148 4.6125 1.6844 14.6536 2.4117 5.6758 6.0115 4.4456 13.6877 14.4490 1.2935 4.8290 7.6066 9.7092 17.7175 10.7612 1.9030 9.7503 4.4060 0.1675 7.8624 2.5457 0.8143 16.8165 3.9319 9.1251 16.4348 18.0091 26.1471 1.2930 11.7385 19.7483 26.7478 7.4389 0.7959 3.7099 38.5970 2.5759 14.3977 1.6786 8.4895 5.6234 2.2031 5.6254 22.8973 92.1685 1.2657 62.9335 15.9683 7.6120 39.2773 45.0352 114.2012 87.5930 176.9118 38.2140 5.7191 57.9277 15.1982 33.7899 28.1141 36.4593 22.1580 21.1671 7.2593 0.8489 4.7204 5.9159 2.9479 32.0817 99.0636 27.1423 3.0033 5.9479 6.0035 31.4327 30.7337 39.9667 17.0557 16.6497 87.1200 62.2927 1.1368 15.1527 85.8717 20.5191 26.6612 6.8497 8.4375 5.2890 39.8826 32.3291 69.8025 0.1250 0.7133 18.8256 1.4456 18.8896 63.3765 218.7336 21.7910 48.1284 21.9363 53.7470 5.9463 1.7801 359.2795 31.9371 200.6188 27.1393 391.0129 4.6834 66.2139 413.6068 85.8452 251.0370 27.0747 8.5167 81.1896 54.7368 6.1100 44.9290 13.3301 31.4542 3.9318 1.6101 13.2997 3.8326 3.5382 13.2547 10.2999 33.1271 3.1455 9.7058 25.4252 12.9429 8.1334 5.6579 0.6285 15.1015 5.4728 1.4236 4.8290 8.9993 6.7099 5.9367 16.0611 5.5343 90.5510 46.6718 123.4389 281.1411 142.1494 90.6707 839.1370 163.2997 495.2286 63.2343 82.7726 86.7222 42.1753 33.3656 70.2295 7.9714 7.2737 15.7581 14.2146 12.3919 21.6161 20.7490 35.8768 19.2356 41.7101 52.6434 54.4288 2.4199 37.5227 12.5660 4.5187 50.0531 9.3633 5.9381 10.3378 14.2237 1.8071 10.5058 19.4733 3.9521 39.4458 16.8637 27.6938 44.0494 0.9323 6.3966 17.7767 12.9808 0.9320 3.3810 6.9741 16.2707 0.3524
temp: 298.150 k
press: 1.00000 atm
elementType: 6 6 6 6 8 6 6 8 14 6 6 6 6 6 6 6 1 1 1 1 1 1 1 1 8 1 1 1 1 1 1 6 1 1 1 6 1 1 1 6 1 1 1 6 8 8 6 8 8 6 6 1 1 1 1 1 6 6 1 1 1 1 1 6 6 6 6 1 6 1 6 1 1 7 6 1 1 1 6 1 1 1
symmnumber: 1
zpe: 1822617.0 jmol-1
zpe.correction: 0.694198 hartree
zpe.thermalcorrener: 0.736728 hartree
zpe.thermalcorrenthalpy: 0.737672 hartree
zpe.thermalcorrgfe: 0.617818 hartree
zpe.sumelectzpe: -2038.542286 hartree
zpe.sumelectthermal: -2038.499756 hartree
zpe.sumelectthermalent: -2038.498812 hartree
zpe.sumelectthermalfe: -2038.618666 hartree
dipole: -2.0014 -1.8157 -0.2676
dipole: 2.7155
quadrupole: -203.5349 -226.2212 -241.8443
quadrupole: 8.1430 -10.6837 -9.3355
quadrupole: 20.3319 -2.3544 -17.9775 8.1430 -10.6837 -9.3355
hfenergy: -2039.2364844 hartree
pointgroup: C01 [X(C30H43N1O7Si1)]
dipole: 0.5664196 0.8738072 -0.2388407 debye
polarizability: 511.0559535|41.144312|470.7057595|-48.2635788|0.5892784|340.9783447 unknown
InChI: InChI=1S/C30H43NO7Si/c1-10-35-27(33)30(28(34)36-11-2,19-12-13-22-14-16-23(17-15-22)31(6)7)21-25-26(32)24(18-20-37-25)38-39(8,9)29(3,4)5/h12-18,20H,10-11,19,21H2,1-9H3
charge 0 multiplicity 1
82 atoms
C  -0.85866088 0.57453221 1.66554681
C  -0.9325091 1.73060955 -0.14030232
C  -0.19884786 2.88357227 0.14186774
C  0.57537152 2.24644277 2.22265325
O  -0.58179643 1.61816804 2.47238827
C  1.69693476 1.49682975 1.82695767
C  1.53719792 0.21885761 1.35257265
O  2.58293432 -0.51534236 0.96999021
Si 2.69592527 -1.83619475 -0.11696566
C  -2.26798118 0.08291518 1.74597554
C  -2.44545081 1.687651 -0.12241419
C  -2.93156443 0.3137846 0.37426947
C  0.19274001 -0.32122659 1.23260007
C  4.57405849 -1.84931942 -0.39278904
C  1.81968291 -1.4930492 -1.7373108
C  2.17918754 -3.44134785 0.69671776
H  -0.50548561 1.02524148 -0.84762799
H  -0.73234458 3.72494375 0.58425698
H  0.6720749 3.18224013 2.75977268
H  -2.29902737 -0.97581794 2.01252562
H  -2.81225239 0.66330676 2.49384125
H  2.67380677 1.96717632 1.80585552
H  -2.84160852 2.46160844 0.54587252
H  -2.83030214 1.87402443 -1.13014308
O  -0.04956164 -1.42209152 0.70461354
H  1.11973772 -3.63890133 0.52460789
H  2.33425132 -3.38445142 1.77900031
H  2.76517748 -4.28649482 0.31980277
H  2.33610109 -0.73719859 -2.33844901
H  0.78415549 -1.17877105 -1.57735434
H  1.78996863 -2.41551417 -2.33004219
C  4.93596093 -2.91399037 -1.43719522
H  6.02211748 -2.93640309 -1.59917083
H  4.63448729 -3.91994311 -1.12346292
H  4.46569397 -2.70939037 -2.4062077
C  5.28004826 -2.17104049 0.93111591
H  6.37003961 -2.1746213 0.79406188
H  5.04354912 -1.42877413 1.7010935
H  4.99488291 -3.15738698 1.3147133
C  5.04842619 -0.47864655 -0.89451883
H  6.14270471 -0.46764582 -0.99650292
H  4.6285675 -0.24532749 -1.88021101
H  4.76329967 0.32507061 -0.20730791
C  -4.45056933 0.30551974 0.50979509
O  -5.05399941 0.42892988 1.54718364
O  -5.03461078 0.19297132 -0.68650782
C  -2.53172558 -0.78690165 -0.61519363
O  -2.00682308 -0.60075238 -1.6862113
O  -2.85453303 -1.98711544 -0.13639837
C  -2.31849796 -3.10556073 -0.8640337
C  -2.53988549 -4.33604806 -0.01663999
H  -1.25572852 -2.9133799 -1.03652373
H  -2.82374012 -3.17169131 -1.83257785
H  -2.14494877 -5.21592019 -0.53089893
H  -2.0238262 -4.23173149 0.94106812
H  -3.60429867 -4.49469655 0.1742343
C  -6.4747743 0.20434879 -0.68754917
C  -6.92230796 0.04708625 -2.12150324
H  -6.81694819 1.14614404 -0.24879684
H  -6.82960726 -0.6121252 -0.0521528
H  -8.01403544 0.0485925 -2.16895791
H  -6.54663625 0.86837901 -2.73630471
H  -6.55754854 -0.89460447 -2.53840434
C  1.07313688 3.21894731 -0.51857195
C  1.64226501 4.48648072 -0.34961055
C  1.81486509 2.28918114 -1.25905146
C  2.88248856 4.81749568 -0.87679282
H  1.10309278 5.23484192 0.22756655
C  3.05740835 2.5999188 -1.7898739
H  1.42946417 1.28632778 -1.4201403
C  3.62796991 3.87740917 -1.61716458
H  3.27170179 5.81339388 -0.70398841
H  3.58692903 1.83496308 -2.34427393
N  4.86363421 4.19269536 -2.16048738
C  5.70327341 3.10713053 -2.62766451
H  5.92292941 2.37057891 -1.83928835
H  5.23112317 2.58106988 -3.46325393
H  6.6455077 3.51867638 -2.99050519
C  5.52117535 5.40499903 -1.71698809
H  4.93007886 6.28711713 -1.98189489
H  5.69597066 5.42200526 -0.63038486
H  6.48318023 5.49206145 -2.2227517
