program: Gaussian 09
title: 000005517
version: EM64L-G09RevD.01
frameworkgroup: C1[X(C19H15F3N4O3)]
method: RPBEPBE
basis: SDD
operation: Freq
keyword: #p
keyword: freq=noraman
keyword: PBEPBE/SDD
title: #p freq=noraman PBEPBE/SDD
converged: YES YES NO NO
title: Mulliken charges:
elementType: F F F O O O N N N N C C C C C C C C C C C C C C C C C C C H H H H H H H H H H H H H H H
charge: -0.197503 -0.168817 -0.192259 -0.225636 -0.381467 -0.283311 -0.143296 -0.578302 -0.061463 -0.234338 -0.147705 -0.465168 -0.379932 -0.368998 0.071280 0.207387 -0.033311 0.228005 -0.401930 0.074150 -0.320537 0.112789 0.268321 0.282839 -0.259529 0.102160 -0.518690 -0.388504 0.377547 0.241712 0.212279 0.250177 0.220367 0.248771 0.239384 0.248393 0.265219 0.280405 0.310993 0.306569 0.267364 0.287764 0.268118 0.378705
chargesum: 0.00000
title: Mulliken charges with hydrogens summed into heavy atoms:
elementType: F F F O O O N N N N C C C C C C C C C C C C C C C C C C C
charge: -0.197503 -0.168817 -0.192259 -0.225636 -0.002762 -0.283311 -0.143296 -0.032678 -0.061463 -0.234338 0.094006 -0.002712 0.089206 0.118779 0.071280 0.207387 -0.033311 0.228005 -0.090937 0.074150 -0.013968 0.112789 0.268321 0.282839 0.007835 0.102160 -0.230926 -0.120386 0.377547
polarizability: 3.69765854e+02 -2.14792705e+01 2.87535370e+02 -8.84693030e+00 -1.09578226e+01 1.43598477e+02
1716.lowfreq: -8.6033 -7.1440 -0.0002 0.0003 0.0004 1.2636 14.2388 27.6373 31.4866
frequency: 13.6931 27.6349 31.4734 38.8919 43.0632 45.6307 55.4742 71.2042 88.4675 135.1520 143.9490 151.4999 176.1327 185.3428 209.5321 223.6441 225.5666 229.5449 238.9070 258.0255 262.8747 271.9530 315.4643 337.9195 347.1124 358.0845 374.6686 382.2838 388.3483 442.3040 448.2986 452.7774 472.1429 478.6805 508.4587 518.5865 521.3038 529.9066 561.2614 579.3055 588.2459 599.1031 602.2398 627.5052 639.4705 665.1246 689.9399 708.7456 713.1429 721.2988 738.6209 740.4449 768.8323 798.8986 802.2925 814.9885 831.9056 855.6613 868.7299 922.8975 925.5625 931.8447 939.8294 947.5783 955.6608 968.0787 990.4538 1019.8467 1047.0673 1072.6613 1080.9901 1097.3529 1112.4801 1132.6966 1137.0377 1145.0352 1154.5930 1162.8582 1165.9169 1193.6981 1219.9999 1224.6731 1247.4091 1250.8358 1279.4906 1293.0058 1294.3226 1306.8110 1314.7650 1326.7675 1346.6419 1366.3341 1374.4135 1377.9687 1383.7977 1389.3004 1417.1575 1433.7652 1464.3895 1478.2589 1481.3050 1491.0684 1495.3718 1543.2349 1550.9647 1584.6897 1602.1826 1606.2936 1621.6336 1626.7806 1639.4214 2965.7810 2995.8946 2998.4871 3012.7970 3056.6814 3079.3982 3099.0854 3160.5079 3162.7285 3167.9888 3190.0697 3193.7232 3474.4288 3494.1882 3606.6058
redmass: 6.2245 9.6549 8.5809 7.1424 3.5898 8.4415 8.0949 4.6570 5.0445 8.0435 9.3237 7.0216 1.9571 4.9114 5.4530 3.4922 4.4493 1.7905 7.6242 7.5290 5.1455 5.9325 11.7584 7.5215 5.7574 6.1868 10.4263 5.2563 4.1079 2.0706 4.6837 3.7025 4.7779 5.1065 5.8040 5.1622 4.7529 1.8447 4.2031 5.9439 5.3060 3.5155 1.6126 5.5289 6.5791 4.6477 4.5200 7.3450 7.7723 4.7778 4.0065 7.0942 5.6368 6.6464 4.1859 1.5312 2.2139 1.5818 2.3322 2.8929 1.4028 1.6062 1.4056 3.3413 1.5102 5.1103 1.9918 1.3995 3.4789 3.7763 2.3627 2.4537 3.6906 1.6723 2.4473 1.3976 1.8705 1.7578 2.4455 1.9349 1.9666 2.0178 1.5124 1.6343 1.6364 1.5184 2.2326 1.6689 1.7952 2.0307 1.8368 5.2792 4.3013 5.9251 1.5537 8.1596 4.7324 9.3806 1.0974 3.1855 1.2984 1.1768 3.5197 9.5224 8.9667 8.0480 8.7953 8.9225 8.1380 8.1194 1.0989 1.0665 1.0717 1.0657 1.0795 1.0977 1.0984 1.1006 1.0914 1.0927 1.0927 1.0963 1.0942 1.0450 1.0635 1.0986
irintensity: 0.2740 1.9992 0.3250 1.1591 0.0156 1.8157 0.1637 0.0749 0.0248 0.0756 0.8129 1.2526 5.3744 8.2079 4.6025 14.5238 6.1429 20.0733 3.9083 2.1897 14.5036 8.3510 8.5653 2.4441 4.3065 1.9479 6.2018 2.5416 15.4856 8.3180 0.8631 0.5441 31.3228 14.2439 3.7519 43.0610 54.5758 295.8966 44.4029 29.0012 53.9690 25.9877 86.5659 0.7037 8.3868 23.2673 4.0348 29.2856 6.6831 1.7028 5.5862 2.1209 19.3606 29.3338 9.7765 18.8905 1.6189 55.9965 1.5218 45.9182 15.6577 26.2536 2.6239 35.7265 7.6208 9.3403 19.4150 3.2100 330.1628 7.7882 26.3766 50.5094 13.5588 20.0051 97.9975 15.3070 49.6338 24.6341 22.3963 59.9945 5.5696 60.8687 14.2601 24.1603 16.5266 27.1109 20.3158 8.7356 8.0735 70.6053 19.1186 67.6731 39.5441 75.8506 9.1228 71.1399 12.6104 533.2418 26.5220 256.8468 103.6274 3.7081 238.5767 122.7679 80.8125 408.5078 41.5444 244.3630 26.8763 555.2302 39.2862 33.0604 37.1374 13.7903 35.9073 22.2222 19.0851 39.3190 3.4741 4.2321 9.6747 0.5782 1.5718 2.0645 37.5676 2.2951
temp: 298.150 k
press: 1.00000 atm
elementType: 9 9 9 8 8 8 7 7 7 7 6 6 6 6 6 6 6 6 6 6 6 6 6 6 6 6 6 6 6 1 1 1 1 1 1 1 1 1 1 1 1 1 1 1
symmnumber: 1
zpe: 829701.8 jmol-1
zpe.correction: 0.316017 hartree
zpe.thermalcorrener: 0.341510 hartree
zpe.thermalcorrenthalpy: 0.342454 hartree
zpe.thermalcorrgfe: 0.257991 hartree
zpe.sumelectzpe: -1475.174453 hartree
zpe.sumelectthermal: -1475.148960 hartree
zpe.sumelectthermalent: -1475.148016 hartree
zpe.sumelectthermalfe: -1475.232479 hartree
dipole: -6.3007 3.6250 -1.5892
dipole: 7.4408
quadrupole: -171.5846 -178.0395 -158.5305
quadrupole: 9.4465 -1.0299 -1.9579
quadrupole: -2.1997 -8.6547 10.8544 9.4465 -1.0299 -1.9579
hfenergy: -1475.4904697 hartree
pointgroup: C01 [X(C19H15F3N4O3)]
dipole: -2.2434731 -1.7751672 0.6208044 debye
polarizability: 360.3709765|33.8972472|295.4020541|15.5782921|-13.5742936|145.1266705 unknown
InChI: InChI=1S/C19H15F3N4O3/c20-9-1-2-15(13(21)5-9)26-8-12(19(28)29)16(27)11-6-14(22)18(24-17(11)26)25-4-3-10(23)7-25/h1-2,5-6,8,10,28H,3-4,7,23H2
charge 0 multiplicity 1
44 atoms
F  -2.186236 3.905743 -0.262315
F  -0.007901 -1.53051 -2.085246
F  -0.528709 -5.656961 0.334794
O  2.915426 3.556408 -0.028195
O  5.427967 2.346054 0.044519
O  5.49904 0.050056 0.313133
N  -3.07654 1.125787 -0.068006
N  -5.82067 -1.371514 0.115211
N  -0.83729 0.462434 0.019964
N  1.380447 -0.346766 0.09639
C  -5.022964 -0.244876 -0.367781
C  -5.433974 1.102702 0.279131
C  -3.487348 -0.299259 -0.081747
C  -4.253894 2.048182 -0.02276
C  -1.75325 1.480267 -0.061203
C  -1.26526 2.8380 -0.14093
C  0.48406 0.754938 0.01648
C  1.033099 2.064204 -0.033611
C  0.087447 3.126245 -0.120054
C  2.491993 2.356672 0.008967
C  2.740761 -0.12133 0.143855
C  3.33223 1.137261 0.106479
C  0.877768 -1.698853 0.166305
C  0.184105 -2.278313 -0.920066
C  1.103777 -2.48865 1.315624
C  4.816912 1.104615 0.167568
C  -0.301114 -3.593722 -0.88762
C  0.645547 -3.821656 1.384782
C  -0.05402 -4.337223 0.280222
H  -5.172119 -0.17199 -1.462034
H  -5.546255 0.960912 1.371601
H  -6.391035 1.477624 -0.11612
H  -3.289646 -0.775047 0.90118
H  -2.914148 -0.858979 -0.841113
H  -4.38136 2.55828 -0.996164
H  -4.11858 2.823663 0.747896
H  -5.778341 -1.532565 1.125567
H  -5.756335 -2.232667 -0.431699
H  0.457627 4.15473 -0.175542
H  3.379786 -1.007513 0.202462
H  1.632207 -2.045199 2.165209
H  -0.828843 -4.0249 -1.741561
H  0.815302 -4.441381 2.268436
H  6.414132 2.206894 0.097192
